program: Gaussian 09
title: 000011003
version: EM64L-G09RevD.01
frameworkgroup: C1[X(C9H17FO)]
method: RPBEPBE
basis: SDD
operation: Freq
keyword: #p
keyword: freq=noraman
keyword: PBEPBE/SDD
title: #p freq=noraman PBEPBE/SDD
converged: YES YES NO NO
title: Mulliken charges:
elementType: F O C C C C C C C C C H H H H H H H H H H H H H H H H H
charge: -0.251699 -0.212904 -0.370068 -0.368135 -0.359657 -0.371841 -0.404137 -0.487774 -0.220626 0.214648 -0.767694 0.196753 0.189426 0.191376 0.186972 0.220821 0.185791 0.216805 0.217887 0.195317 0.223651 0.228441 0.230419 0.201544 0.191806 0.232955 0.233788 0.256136
chargesum: 0.00000
title: Mulliken charges with hydrogens summed into heavy atoms:
elementType: F O C C C C C C C C C
charge: -0.251699 -0.212904 0.016110 0.010213 0.046955 0.062851 0.014831 -0.028914 0.172724 0.214648 -0.044815
polarizability: 1.25141491e+02 2.80473719e+00 9.43826144e+01 9.96863490e-01 -2.61984980e+00 7.99465473e+01
1716.lowfreq: -76.2906 -24.0708 -7.6464 -0.0007 0.0002 0.0006 3.0411 24.8197 26.6472
frequency: -76.1708 24.0473 26.2641 51.4500 70.5363 73.7772 104.8061 128.0594 138.2329 159.5031 216.4901 255.1023 331.0376 412.1241 428.7318 457.1588 508.0734 580.1949 713.2680 730.9216 759.2603 815.3797 820.6971 868.2484 890.1483 930.8821 942.0233 990.1665 1009.4798 1034.7861 1051.8999 1080.7938 1085.0295 1103.5673 1122.2090 1140.7252 1166.5537 1191.7364 1214.5828 1235.3450 1259.8524 1277.4163 1281.7046 1291.2495 1294.6186 1319.3624 1351.3762 1359.7552 1365.0061 1369.3970 1373.7730 1427.6554 1443.0044 1443.1789 1453.8312 1462.2752 1464.9314 1468.4295 1475.8846 1486.3296 1635.3302 2949.6370 2952.7754 2956.5834 2965.0010 2971.7884 2980.4757 2989.4833 2993.4869 2994.4321 2999.7468 3011.8978 3026.3593 3048.7713 3057.6196 3063.5744 3073.1185 3122.5683
redmass: 1.1454 5.4461 3.5646 3.6086 2.0428 2.6292 2.9860 2.1128 2.2551 2.9065 3.6484 3.0280 3.1228 3.5225 2.9154 2.0043 2.6469 4.1373 1.1177 1.1201 1.3227 1.7085 2.9963 2.3870 1.5483 2.0185 1.4785 1.5560 2.5936 2.8591 2.4079 2.1755 2.3270 2.8102 1.7887 1.4602 1.8588 1.3506 1.4436 1.3770 1.2894 1.3120 1.0882 1.1332 1.1089 1.4676 1.5622 1.7303 1.2530 1.5360 1.2997 1.0823 1.0817 1.0822 1.0503 1.0689 1.0779 1.0922 1.0931 1.0997 7.5243 1.0592 1.0598 1.0599 1.0624 1.0626 1.0376 1.0964 1.0602 1.0969 1.0590 1.0979 1.0982 1.1026 1.1031 1.0966 1.1105 1.0997
irintensity: 0.7256 6.7246 2.4218 3.1790 0.7534 0.4442 0.3735 0.2110 0.4706 6.5157 0.8566 5.2050 1.4757 1.4906 1.6564 0.3085 7.8327 5.2184 9.9743 3.3675 1.1161 5.9027 0.5906 17.4319 6.3109 8.5076 6.8610 22.1364 2.5870 2.9029 14.9590 0.8769 3.6492 1.3226 0.8977 4.1407 25.1800 32.8727 12.9446 25.6911 0.9945 14.3836 2.8144 1.4984 1.3847 28.9507 9.8477 6.1024 64.2298 5.3382 5.5052 12.8760 15.8548 24.6944 21.6473 0.5628 1.1461 4.6423 0.6085 23.3317 102.0669 2.0803 17.1519 19.5847 34.4835 52.8631 7.4651 2.5777 34.6267 7.7669 52.4689 18.6370 3.9395 38.4253 101.1579 31.5991 64.1800 15.5669
temp: 298.150 k
press: 1.00000 atm
elementType: 9 8 6 6 6 6 6 6 6 6 6 1 1 1 1 1 1 1 1 1 1 1 1 1 1 1 1 1
symmnumber: 1
zpe: 635964.6 jmol-1
zpe.correction: 0.242226 hartree
zpe.thermalcorrener: 0.255720 hartree
zpe.thermalcorrenthalpy: 0.256664 hartree
zpe.thermalcorrgfe: 0.198974 hartree
zpe.sumelectzpe: -527.312286 hartree
zpe.sumelectthermal: -527.298792 hartree
zpe.sumelectthermalent: -527.297848 hartree
zpe.sumelectthermalfe: -527.355538 hartree
dipole: -0.2356 -1.3162 2.2317
dipole: 2.6016
quadrupole: -74.8801 -72.2640 -67.0682
quadrupole: 21.9351 4.6634 0.1862
quadrupole: -3.4760 -0.8599 4.3359 21.9351 4.6634 0.1862
hfenergy: -527.5545123 hartree
pointgroup: C01 [X(C9H17F1O1)]
dipole: -0.0864153 -0.527269 0.8730165 debye
polarizability: 125.1102058|2.9855799|94.4717064|0.8942874|-2.476316|79.8887408 unknown
InChI: InChI=1S/C9H17FO/c1-9(11)7-5-3-2-4-6-8-10/h2-8H2,1H3
charge 0 multiplicity 1
28 atoms
F  5.20555 -0.911476 -0.761795
O  -4.111783 1.23993 -0.368023
C  1.123222 0.547274 0.048931
C  -0.085857 -0.401315 0.211255
C  2.479694 -0.154658 0.276389
C  -1.438749 0.306522 -0.019594
C  3.682974 0.797371 0.102758
C  -2.638465 -0.645688 0.134771
C  5.033849 0.11051 0.282555
C  -4.002317 0.016598 -0.086781
C  -5.228913 -0.881031 0.056036
H  1.105377 0.988563 -0.969272
H  1.02033 1.3961 0.757041
H  0.018985 -1.247616 -0.499583
H  -0.066958 -0.845791 1.228865
H  2.587206 -0.998912 -0.432068
H  2.501793 -0.593403 1.296288
H  -1.550423 1.150149 0.688113
H  -1.461595 0.75762 -1.030138
H  3.620434 1.623282 0.842606
H  3.648929 1.266257 -0.900148
H  -2.643247 -1.108892 1.145113
H  -2.552649 -1.499879 -0.570595
H  5.878935 0.813935 0.167834
H  5.104071 -0.420008 1.251274
H  -5.162601 -1.744197 -0.632955
H  -5.286795 -1.293403 1.081687
H  -6.145497 -0.310141 -0.157464
