program: Gaussian 09
title: 000098182
version: EM64L-G09RevD.01
frameworkgroup: C1[X(C17H16O3)]
method: RPBEPBE
basis: SDD
operation: Freq
keyword: #pfreq=noraman
keyword: PBEPBE/SDD
title: #p freq=noraman PBEPBE/SDD
converged: YES YES NO NO
title: Mulliken charges:
elementType: O O O C C C C C C C C C C C C C C C C C H H H H H H H H H H H H H H H H
charge: -0.259775 -0.257989 -0.265798 0.297648 0.495490 0.095545 -0.280677 -0.316530 -0.360497 -0.357864 -0.396361 -0.324150 0.326977 0.322239 -0.378136 -0.362095 -0.363573 -0.370798 -0.536971 -0.536562 0.270868 0.219725 0.279361 0.229594 0.237548 0.204411 0.251304 0.242897 0.252764 0.243687 0.225631 0.247236 0.225531 0.225297 0.225314 0.248710
chargesum: 0.00000
title: Mulliken charges with hydrogens summed into heavy atoms:
elementType: O O O C C C C C C C C C C C C C C C C C
charge: -0.259775 -0.257989 -0.265798 0.297648 0.495490 0.095545 -0.009809 -0.096805 -0.081136 -0.128270 -0.158813 -0.119739 0.326977 0.322239 -0.126833 -0.119198 -0.110809 -0.127111 0.161427 0.162759
polarizability: 4.87002792e+02 9.62158302e-01 1.89333943e+02 2.84742081e-01 3.30200749e-02 8.54082115e+01
1716.lowfreq: -10.4799 -2.1603 -1.0115 -0.0015 -0.0010 0.0008 12.9087 23.2314 38.8425
frequency: 11.7712 23.1563 38.8416 54.3070 78.9226 107.7631 121.5564 135.3532 153.3258 167.1944 190.2297 216.8186 221.8605 238.8025 249.2127 309.0497 315.5281 367.8712 373.2235 412.8918 419.2920 432.3599 473.2084 501.3222 514.4985 520.2367 544.0583 584.3057 628.7625 632.7275 671.3684 711.8112 732.0579 758.5789 766.6609 807.2982 813.5103 819.7929 834.5401 845.5516 879.4297 881.6701 947.2908 958.3538 968.4443 983.5963 984.3556 991.9234 996.3937 999.0655 1014.4031 1033.4003 1111.2648 1111.4020 1112.2898 1116.2043 1155.0592 1156.4110 1170.4964 1181.3901 1216.8571 1226.4528 1237.1500 1244.3040 1288.9806 1303.2936 1319.2536 1338.2503 1372.6936 1383.0096 1425.6184 1432.5159 1436.1330 1436.7394 1466.3467 1466.7895 1470.7091 1471.2892 1497.1082 1502.9078 1508.5070 1568.0506 1575.7617 1612.6974 1620.1539 1634.3892 2965.2285 2965.8130 3055.8479 3056.8700 3092.5504 3128.9909 3129.2317 3130.8542 3139.4773 3143.1470 3146.0308 3154.1077 3164.7234 3165.1097 3170.3680 3172.8235
redmass: 3.5027 3.7802 5.6307 4.6571 4.5086 4.0218 3.6455 5.0771 3.2860 4.7496 1.8054 1.1524 5.4107 1.5392 3.4313 4.5376 5.5325 6.1857 4.0807 2.9153 2.9320 5.0601 4.4620 2.8017 4.7561 2.4030 4.7397 6.3003 7.0979 6.9129 3.3706 5.6788 3.4053 3.6346 5.8483 6.4898 1.3007 1.2733 1.5581 1.7790 4.4035 1.9840 1.3598 1.3903 1.3611 8.8710 8.8211 1.3571 3.1613 2.6433 1.2264 3.0125 1.3616 1.2590 1.2595 1.3607 1.3476 1.3302 1.2807 1.2302 1.5312 2.9349 3.0708 2.5858 1.3543 1.6023 1.6446 1.8792 4.5102 4.0575 4.0031 3.2642 1.2612 1.2020 1.0500 1.0498 1.0706 1.0803 2.6150 2.5864 7.7272 6.7834 7.2594 5.9789 6.3648 5.7803 1.0327 1.0326 1.1042 1.1043 1.0889 1.0998 1.0928 1.0964 1.0894 1.0885 1.0877 1.0871 1.0958 1.0943 1.0964 1.0963
irintensity: 0.4719 2.4990 0.8711 0.1795 0.0477 12.1168 0.2532 4.4187 6.2383 0.3367 0.3542 0.1635 3.5425 0.2206 3.8884 0.2543 4.6183 7.4871 2.0089 0.0095 0.1151 6.5208 25.9248 1.4059 8.6406 33.3353 53.9574 31.5827 9.1401 2.1184 5.8190 1.1095 0.0620 2.0143 8.3516 15.3761 26.6005 0.1155 132.2471 14.9641 1.3082 3.1414 3.1626 0.8697 0.8229 116.4177 20.2203 0.8651 33.3944 14.1258 39.3509 96.1113 3.6785 0.1791 0.1807 32.0377 0.0738 18.9714 605.2590 63.7989 37.1206 297.5549 134.2889 302.2782 6.0167 29.4500 136.2391 70.9409 39.9600 79.5388 6.8728 72.8230 1.0501 14.4483 14.0645 14.5484 68.5118 57.3005 194.5633 126.6975 120.5753 72.0611 26.8105 815.2084 20.7360 124.5679 124.5063 61.8060 43.8236 44.7944 0.8917 27.4331 26.4075 6.7603 2.1667 11.2669 2.0331 17.1779 23.3524 17.3523 7.9130 11.1762
temp: 298.150 k
press: 1.00000 atm
elementType: 8 8 8 6 6 6 6 6 6 6 6 6 6 6 6 6 6 6 6 6 1 1 1 1 1 1 1 1 1 1 1 1 1 1 1 1
symmnumber: 1
zpe: 744015.0 jmol-1
zpe.correction: 0.283380 hartree
zpe.thermalcorrener: 0.302088 hartree
zpe.thermalcorrenthalpy: 0.303032 hartree
zpe.thermalcorrgfe: 0.233731 hartree
zpe.sumelectzpe: -881.619145 hartree
zpe.sumelectthermal: -881.600438 hartree
zpe.sumelectthermalent: -881.599493 hartree
zpe.sumelectthermalfe: -881.668794 hartree
dipole: -1.3203 -1.1326 0.0121
dipole: 1.7395
quadrupole: -51.1989 -120.8652 -123.4684
quadrupole: -5.3822 0.3015 0.0197
quadrupole: 47.3120 -22.3544 -24.9576 -5.3822 0.3015 0.0197
hfenergy: -881.9025252 hartree
pointgroup: C01 [X(C17H16O3)]
dipole: 0.5225356 -0.4416797 0.0161046 debye
polarizability: 486.8978156|1.2958929|189.246561|6.4319477|-3.0282157|85.6005703 unknown
InChI: InChI=1S/C17H16O3/c1-19-15-8-3-13(4-9-15)5-12-17(18)14-6-10-16(20-2)11-7-14/h3-12H,1-2H3
charge 0 multiplicity 1
36 atoms
O  -6.297747 -1.490294 -0.081084
O  6.508345 -1.251864 0.097014
O  -1.183993 2.442322 -0.118426
C  -2.518325 0.437368 -0.083406
C  2.606719 0.427815 -0.004836
C  -1.203269 1.16232 -0.084112
C  1.272302 1.025346 -0.039236
C  -2.654224 -0.980636 -0.028886
C  -3.703386 1.218503 -0.138449
C  2.841815 -0.9829 0.028476
C  3.743895 1.283732 -0.003476
C  0.059442 0.382854 -0.045803
C  -5.08945 -0.786735 -0.085455
C  5.259519 -0.624519 0.062231
C  -3.9199 -1.58795 -0.02936
C  -4.979804 0.628264 -0.140666
C  4.14086 -1.502867 0.061418
C  5.059091 0.778648 0.029386
C  -7.541699 -0.714443 -0.137084
C  7.702462 -0.399742 0.099812
H  1.223298 2.124686 -0.062746
H  -1.77268 -1.627048 0.016405
H  -3.588141 2.306878 -0.178895
H  1.994659 -1.676998 0.028531
H  3.588818 2.36918 -0.028606
H  0.005814 -0.710043 -0.024839
H  -4.032678 -2.675367 0.012875
H  -5.869614 1.263268 -0.184639
H  4.326135 -2.580925 0.08696
H  5.90462 1.472431 0.029258
H  -7.637333 -0.046956 0.740655
H  -8.346078 -1.464002 -0.123962
H  -7.600438 -0.118297 -1.067794
H  7.724744 0.255212 0.991968
H  7.756384 0.216822 -0.817959
H  8.551339 -1.09786 0.129429
