program: Gaussian 09
title: 000098119
version: EM64L-G09RevD.01
frameworkgroup: C1[X(C15H13N3O6)]
method: RPBEPBE
basis: SDD
operation: Freq
keyword: #p
keyword: freq=noraman
keyword: PBEPBE/SDD
title: #p freq=noraman PBEPBE/SDD
converged: YES YES NO NO
title: Mulliken charges:
elementType: O O O O O O N N N C C C C C C C C C C C C C C C H H H H H H H H H H H H H
charge: -0.414868 -0.191153 -0.186571 -0.259480 -0.212471 -0.205027 -0.387852 0.026467 0.016520 -0.150763 -0.670169 0.517833 0.356929 0.156947 0.237492 -0.273115 -0.406111 -0.396327 -0.501254 0.448131 -0.420244 -0.227220 -0.233634 -0.236951 0.287777 0.249580 0.250783 0.368330 0.263161 0.234083 0.238007 0.336418 0.292714 0.230237 0.236623 0.234898 0.390280
chargesum: 0.00000
title: Mulliken charges with hydrogens summed into heavy atoms:
elementType: O O O O O O N N N C C C C C C C C C C C C C C C
charge: -0.024587 -0.191153 -0.186571 -0.259480 -0.212471 -0.205027 -0.019522 0.026467 0.016520 0.137014 -0.169806 0.517833 0.356929 0.156947 0.237492 -0.009954 -0.172028 -0.158320 -0.164836 0.448131 -0.127531 0.003017 0.002989 -0.002052
polarizability: 2.72795485e+02 1.71085281e+00 2.25292989e+02 -1.16035599e+01 3.03265997e+01 1.71665783e+02
1716.lowfreq: -2.7604 -0.0007 -0.0004 0.0005 2.9208 9.6492 15.2656 21.3464 23.7448
frequency: 15.1596 21.3347 23.7269 38.2360 52.7228 56.6348 68.1764 75.7728 89.9627 117.8537 146.3179 165.9845 167.1474 210.6381 251.4734 266.2844 311.9100 322.1676 336.8750 346.7041 376.5395 403.6692 419.9937 440.5767 475.6834 496.9389 507.2562 516.8246 562.8178 591.8314 607.1849 617.3605 628.0929 652.7091 659.8155 675.0252 691.1472 705.0980 706.8479 725.8174 754.3732 760.3322 770.5320 793.1140 810.3455 832.7138 856.6507 871.7997 894.1365 917.6435 933.7679 968.4022 979.8207 990.2208 994.8904 1000.4640 1014.8550 1025.6844 1030.5756 1050.8127 1084.4970 1106.6080 1114.2406 1145.3289 1170.5163 1175.5014 1191.3415 1203.8673 1215.9183 1221.7414 1235.1004 1255.4621 1291.8403 1312.3171 1317.5108 1333.1552 1346.6324 1351.1661 1364.7970 1384.2430 1384.9347 1443.5650 1453.7457 1469.7967 1484.4754 1490.8632 1528.6297 1585.2953 1595.1277 1614.2400 1630.0837 1676.2818 3003.1420 3016.9660 3070.4873 3111.7935 3119.7334 3135.9285 3149.4369 3164.7438 3167.2175 3186.5756 3188.7985 3316.8900 3514.3395
redmass: 8.4390 9.3982 6.5311 4.5283 7.2585 11.8806 6.9540 10.1548 6.3556 6.1830 6.4534 5.7519 9.2154 5.9859 7.6023 7.9521 6.1174 7.8581 6.0210 2.2846 11.0360 2.8219 5.5789 3.9249 4.3897 4.0272 7.5270 3.6212 3.8419 2.9532 1.8059 6.2450 6.2511 6.7731 5.5617 8.0791 3.9478 2.0777 5.0503 2.7111 7.4650 1.9541 1.4832 4.0552 4.4811 1.5473 1.2471 3.8993 3.7514 2.3517 1.7096 1.4111 1.3934 6.1512 1.3401 1.3235 3.2051 2.4724 2.5175 2.2987 1.8323 3.4593 2.1728 1.3531 8.1653 1.0551 1.1288 1.8168 2.7146 3.0721 1.4254 1.6583 1.4860 2.2357 1.4597 1.3056 3.9352 1.5337 5.0962 5.6998 5.6304 2.1635 4.8207 1.1516 2.3113 2.5264 3.8112 4.1698 6.0271 6.0936 7.1495 9.0223 1.0643 1.0803 1.1025 1.0887 1.0885 1.0896 1.0953 1.0885 1.1013 1.0958 1.0928 1.0790 1.0643
irintensity: 0.1079 1.1416 0.5522 0.3444 0.3008 0.0550 0.6721 0.7572 0.9682 1.2464 0.6143 2.5982 3.6487 1.9989 2.1281 0.4674 1.3966 0.1126 1.0329 0.4856 0.4265 0.0955 1.2749 0.5584 37.0391 18.2948 1.2250 21.6028 11.9280 56.6080 84.1435 0.3092 12.5519 21.3015 41.5802 12.4106 15.0495 59.4482 16.9695 4.7998 33.0162 39.7373 103.6398 0.7398 8.1315 22.4555 1.1143 3.6209 8.5126 6.0438 7.9018 23.5056 0.5242 0.8786 0.4962 0.6523 79.1815 118.6031 136.3301 15.6674 8.5781 51.8962 5.8126 28.4555 378.9608 1.3197 7.4843 234.2316 44.4171 147.9506 32.9340 30.3255 20.9785 110.8024 27.6875 6.8134 152.5515 30.5103 56.8237 28.4358 26.7829 7.7822 7.0620 11.4298 15.2155 35.7622 124.4077 139.3810 2.4440 6.4022 406.9320 199.0268 12.8222 13.1610 9.5464 7.9874 10.7115 6.2585 26.6726 3.4797 18.9148 3.1780 21.1412 92.2707 40.1032
temp: 298.150 k
press: 1.00000 atm
elementType: 8 8 8 8 8 8 7 7 7 6 6 6 6 6 6 6 6 6 6 6 6 6 6 6 1 1 1 1 1 1 1 1 1 1 1 1 1
symmnumber: 1
zpe: 700547.1 jmol-1
zpe.correction: 0.266824 hartree
zpe.thermalcorrener: 0.287992 hartree
zpe.thermalcorrenthalpy: 0.288936 hartree
zpe.thermalcorrgfe: 0.212451 hartree
zpe.sumelectzpe: -1193.130564 hartree
zpe.sumelectthermal: -1193.109397 hartree
zpe.sumelectthermalent: -1193.108453 hartree
zpe.sumelectthermalfe: -1193.184938 hartree
dipole: 7.5183 4.4345 2.1463
dipole: 8.9887
quadrupole: -167.5010 -128.7686 -144.5863
quadrupole: -4.0864 8.6595 -3.8899
quadrupole: -20.5491 18.1834 2.3657 -4.0864 8.6595 -3.8899
hfenergy: -1193.3973883 hartree
pointgroup: C01 [X(C15H13N3O6)]
dipole: 2.9940978 1.7504561 0.6909967 debye
polarizability: 271.336746|3.3259364|225.3489834|-16.7557879|30.1317718|173.0685283 unknown
InChI: InChI=1S/C15H13N3O6/c19-15(20)13(8-10-4-2-1-3-5-10)16-12-7-6-11(17(21)22)9-14(12)18(23)24/h1-7,9,13,16,19H,8H2
charge 0 multiplicity 1
37 atoms
O  1.422728 3.918326 -0.15462
O  0.37424 2.972623 -2.008681
O  -1.898244 -2.86179 -1.778302
O  0.107358 -1.802003 -1.942204
O  -5.249832 0.736252 2.105592
O  -5.490921 -1.199923 0.914741
N  0.520249 0.42136 -0.621476
N  -1.11496 -1.888994 -1.468975
N  -4.805331 -0.174327 1.299264
C  1.417837 1.516858 -0.269638
C  2.875172 1.176278 -0.72955
C  3.448986 -0.022434 0.012844
C  -0.762664 0.27903 -0.171543
C  0.984408 2.837707 -0.932684
C  -1.594004 -0.844352 -0.560194
C  -1.353807 1.236766 0.724951
C  3.965766 0.134093 1.324996
C  3.457648 -1.311996 -0.576045
C  -2.912242 -0.987774 -0.080454
C  -3.430546 -0.025795 0.794118
C  -2.65331 1.092728 1.201254
C  4.477192 -0.974033 2.035051
C  3.968297 -2.423377 0.132596
C  4.477793 -2.25795 1.44051
H  1.432901 1.678302 0.824553
H  3.491738 2.074183 -0.546533
H  2.862874 0.996891 -1.821224
H  0.836077 -0.322476 -1.266875
H  -0.769262 2.104654 1.040868
H  3.979826 1.129246 1.788554
H  3.072697 -1.453511 -1.593983
H  -3.515132 -1.844422 -0.392355
H  -3.095612 1.824236 1.882668
H  4.878857 -0.837551 3.045241
H  3.966685 -3.4134 -0.335909
H  4.874842 -3.118665 1.989642
H  1.201197 4.776341 -0.608695
