program: Gaussian 09
title: 000098137
version: EM64L-G09RevD.01
frameworkgroup: C1[X(C13H21NO5)]
method: RPBEPBE
basis: SDD
operation: Freq
keyword: #p
keyword: freq=noraman
keyword: PBEPBE/SDD
title: #p freq=noraman PBEPBE/SDD
converged: YES YES NO NO
title: Mulliken charges:
elementType: O O O O O N C C C C C C C C C C C C C H H H H H H H H H H H H H H H H H H H H H
charge: -0.276604 -0.254686 -0.236012 -0.215442 -0.224719 -0.399497 -0.143297 0.097299 -0.068803 -0.587611 0.126783 0.235041 0.218995 -0.727850 -0.716558 -0.218511 -0.226931 -0.673779 -0.668530 0.278014 0.202623 0.257091 0.252768 0.331762 0.232341 0.217925 0.214076 0.201100 0.223762 0.254556 0.230740 0.237301 0.233622 0.229733 0.216709 0.228042 0.236290 0.214609 0.237795 0.229854
chargesum: 0.00000
title: Mulliken charges with hydrogens summed into heavy atoms:
elementType: O O O O O N C C C C C C C C C C C C C
charge: -0.276604 -0.254686 -0.236012 -0.215442 -0.224719 -0.067735 0.134717 0.097299 0.133820 -0.077753 0.126783 0.235041 0.218995 -0.063508 -0.037141 0.249531 0.236424 0.007262 0.013729
polarizability: 1.73051334e+02 -2.76698259e+00 1.56952816e+02 1.03834818e+01 7.16508964e+00 1.53721140e+02
1716.lowfreq: -6.9009 -0.8185 -0.0006 -0.0005 -0.0005 9.0468 21.9569 31.0036 51.0518
frequency: 21.8755 30.9406 51.0293 59.2221 67.7129 73.2613 77.0139 92.6473 105.6867 118.8948 148.2488 157.1909 173.6309 196.2129 198.1691 218.4011 244.3698 249.7709 259.4287 282.7344 292.0193 303.0237 337.9191 358.1735 359.9690 392.7040 403.2964 434.2738 456.0792 512.9717 537.6005 596.0900 613.1030 657.4321 718.9808 742.6488 752.7974 784.2465 798.5449 799.2365 810.4218 824.7700 852.7537 894.5439 921.5955 931.2647 948.6116 964.6162 982.7273 1015.3794 1022.6837 1034.2640 1063.4262 1110.4231 1112.9467 1115.9507 1129.2673 1134.0008 1136.2758 1136.7025 1159.6819 1164.7330 1177.6512 1199.5439 1249.6722 1252.5995 1256.3171 1278.8471 1291.4677 1301.8896 1312.1376 1350.7173 1356.8758 1357.4617 1369.1177 1384.8966 1401.1494 1404.3019 1405.5949 1443.0318 1462.8907 1464.5058 1464.8259 1472.9139 1473.2896 1475.5514 1483.4413 1485.5414 1485.8344 1495.5597 1619.6527 1651.4161 1670.0869 2946.3540 2974.7657 2986.3334 2997.4134 2998.3946 3001.6173 3011.9957 3012.3934 3014.9787 3067.9076 3072.1413 3075.1016 3076.1680 3079.0426 3094.1393 3094.4447 3095.6330 3099.3807 3110.3213 3111.0633 3564.1122
redmass: 3.4218 2.8629 4.8884 2.8452 2.8947 4.3410 2.6871 4.7102 3.5908 2.6909 3.7087 3.7410 2.9476 1.0694 2.7009 2.2360 1.2735 1.7228 1.5068 3.7390 5.5566 3.6610 3.3657 3.7863 2.9165 4.8609 4.0123 5.1620 3.0722 1.9147 4.4104 3.4640 3.7506 1.8609 5.6942 5.2477 7.1826 5.0674 1.1066 1.1077 3.9555 4.1294 3.4899 2.7826 1.2105 2.3212 1.9228 1.4515 3.4220 2.3115 2.7853 2.9926 3.9927 2.4778 2.2965 2.2106 2.7292 1.8956 1.9772 1.4701 2.9081 4.2528 1.8287 1.9992 1.1359 1.1316 1.4377 2.7601 1.3614 1.3843 1.5725 1.4167 1.3835 1.4103 1.9606 1.1983 1.2637 1.2577 1.2007 1.0902 1.0395 1.0399 1.0533 1.0622 1.0624 1.0456 1.0566 1.0667 1.0693 1.0486 11.3738 11.6684 9.1270 1.0827 1.0360 1.0368 1.0359 1.0362 1.0830 1.0659 1.0588 1.0582 1.0992 1.1067 1.1066 1.0994 1.0993 1.0985 1.0984 1.0977 1.0987 1.1031 1.1026 1.0785
irintensity: 0.6303 0.3391 1.2191 1.2953 0.6890 1.2190 1.5664 0.2488 1.1011 0.4673 1.9043 1.6580 0.8632 0.0510 2.1426 7.8225 0.1635 8.3910 1.9224 1.1608 5.8615 2.4786 11.2767 4.5064 3.9114 3.1262 5.1132 5.1337 3.3695 10.8910 2.9448 25.1615 13.8681 108.2585 2.8021 17.4076 14.1505 0.5994 2.6923 5.3904 5.3615 4.7577 1.5832 2.6487 2.3859 18.1912 22.9040 3.5993 45.6695 19.0864 171.2643 50.2660 24.6482 10.1785 3.0912 10.3968 3.1231 85.8585 101.8394 6.9684 287.5094 207.6194 36.9762 29.4777 0.1058 0.2233 5.2576 52.0301 3.1149 19.6050 8.2673 5.2760 0.2374 3.9791 42.6633 18.0295 24.1023 22.1971 24.4977 7.9897 14.0399 12.7623 8.4400 4.2259 4.6891 2.3534 8.6632 10.1907 12.7707 23.9914 159.2341 186.3410 440.9144 26.9015 28.8289 32.4119 18.0075 16.6741 7.3742 11.5744 15.6398 16.9916 16.4324 6.3458 4.1931 33.3408 57.5635 28.1019 29.5620 7.2451 17.6129 38.7032 35.2005 32.4387
temp: 298.150 k
press: 1.00000 atm
elementType: 8 8 8 8 8 7 6 6 6 6 6 6 6 6 6 6 6 6 6 1 1 1 1 1 1 1 1 1 1 1 1 1 1 1 1 1 1 1 1 1
symmnumber: 1
zpe: 862071.4 jmol-1
zpe.correction: 0.328346 hartree
zpe.thermalcorrener: 0.350124 hartree
zpe.thermalcorrenthalpy: 0.351068 hartree
zpe.thermalcorrgfe: 0.276335 hartree
zpe.sumelectzpe: -937.386165 hartree
zpe.sumelectthermal: -937.364387 hartree
zpe.sumelectthermalent: -937.363442 hartree
zpe.sumelectthermalfe: -937.438175 hartree
dipole: -0.7020 1.6447 -2.9023
dipole: 3.4090
quadrupole: -94.7493 -108.4566 -134.5785
quadrupole: -2.7939 -10.6595 -7.4720
quadrupole: 17.8455 4.1382 -21.9837 -2.7939 -10.6595 -7.4720
hfenergy: -937.7145102 hartree
pointgroup: C01 [X(C13H21N1O5)]
dipole: -0.1928465 -0.0492123 -1.3263599 debye
polarizability: 164.0529064|-0.0066704|161.6608486|-16.2389597|1.0303734|158.0115348 unknown
InChI: InChI=1S/C13H21NO5/c1-5-18-11(16)13(12(17)19-6-2)9(8(3)4)7-10(15)14-13/h8-9,14H,5-7H2,1-4H3
charge 0 multiplicity 1
40 atoms
O  2.351567 -0.85629 -0.569046
O  -1.623058 -0.814127 -0.40088
O  -0.564981 -1.853793 3.422772
O  2.587877 1.314217 0.244992
O  -0.187943 0.27328 -1.877711
N  0.416534 -1.099094 1.421659
C  -0.104869 1.229662 1.459788
C  0.43472 0.064084 0.52511
C  -0.875722 2.392987 0.775619
C  -0.92558 0.469197 2.536643
C  -0.366564 -0.956712 2.56324
C  1.891972 0.297857 0.053763
C  -0.45707 -0.141376 -0.727966
C  -1.409843 3.368798 1.855623
C  -0.015646 3.177769 -0.247024
C  3.755204 -0.817861 -1.094427
C  -2.587833 -1.048294 -1.526642
C  4.033136 -2.183223 -1.711679
C  -3.773479 -1.804239 -0.938979
H  0.800797 1.660978 1.930351
H  -1.754271 1.961949 0.247276
H  -0.856715 0.921425 3.538199
H  -1.996431 0.408823 2.264575
H  0.837571 -1.988672 1.148123
H  -2.090428 2.875675 2.572141
H  -1.965142 4.197464 1.379806
H  -0.572214 3.812605 2.427489
H  -0.59247 4.034236 -0.642931
H  0.899128 3.569175 0.233715
H  0.295363 2.556719 -1.103152
H  4.430495 -0.582133 -0.252332
H  3.813591 0.003114 -1.83088
H  -2.060708 -1.621153 -2.310509
H  -2.868872 -0.0656 -1.94678
H  5.056942 -2.201007 -2.127437
H  3.953197 -2.984617 -0.95729
H  3.323357 -2.397149 -2.528486
H  -4.510964 -2.014951 -1.734826
H  -3.451493 -2.763403 -0.499737
H  -4.272055 -1.212619 -0.152469
