program: Gaussian 09
title: 000011005
version: EM64L-G09RevD.01
frameworkgroup: C1[X(C14H28O2)]
method: RPBEPBE
basis: SDD
operation: Freq
keyword: #pfreq=noraman
keyword: PBEPBE/SDD
title: #p freq=noraman PBEPBE/SDD
converged: YES YES NO NO
title: Mulliken charges:
elementType: O O C C C C C C C C C C C C C C H H H H H H H H H H H H H H H H H H H H H H H H H H H H
charge: -0.418244 -0.231033 -0.385699 -0.386190 -0.384987 -0.384053 -0.381956 -0.385254 -0.372968 -0.368738 -0.353369 -0.376345 -0.356791 -0.487908 -0.696665 0.170606 0.193338 0.193349 0.194394 0.194373 0.193268 0.193277 0.193130 0.193168 0.191767 0.191774 0.196345 0.196374 0.189461 0.189444 0.191318 0.191139 0.187530 0.187535 0.218345 0.217331 0.194807 0.194802 0.252283 0.252055 0.209560 0.209571 0.214946 0.374907
chargesum: 0.00000
title: Mulliken charges with hydrogens summed into heavy atoms:
elementType: O O C C C C C C C C C C C C C C
charge: -0.043336 -0.231033 0.000989 0.002577 0.001559 0.002245 0.001585 0.007465 0.005937 0.013719 0.021696 0.059332 0.032818 0.016430 -0.062587 0.170606
polarizability: 2.16511106e+02 3.19083138e-01 1.41647298e+02 -5.19533924e-02 -4.99440501e-02 1.22676331e+02
1716.lowfreq: -2.9145 -0.0017 0.0007 0.0010 6.9267 13.3088 19.2759 20.9099 40.2210
frequency: 18.8551 20.9045 34.4532 41.1822 58.3527 60.2987 71.9138 84.8774 105.0695 110.7975 114.3169 136.5715 138.6084 141.3880 159.3761 160.8752 178.5188 224.3070 243.7768 281.8243 326.7718 394.7180 408.0491 470.1759 485.0603 500.1335 510.0389 588.5153 634.9397 722.3848 723.5845 725.0539 731.3653 746.8544 773.7436 810.7598 854.4356 856.5033 886.8722 902.1940 950.8016 978.2882 984.0933 996.2104 1007.4079 1022.3903 1032.4887 1036.7785 1055.3706 1067.5530 1075.6408 1079.9611 1082.8680 1083.5149 1098.1690 1117.3837 1124.4047 1181.5448 1198.6549 1201.3654 1221.4301 1224.9892 1241.7246 1245.2177 1260.0513 1266.8800 1278.9243 1281.8542 1283.4651 1285.8130 1293.3515 1295.3453 1300.8881 1301.9196 1304.2092 1325.0612 1342.2614 1353.1257 1354.7656 1357.1402 1359.5600 1372.7422 1387.7102 1438.1002 1460.8179 1460.9281 1463.4413 1463.8592 1465.5837 1467.8871 1472.1031 1475.7387 1476.6763 1481.2570 1485.5226 1488.8855 1490.5875 1669.5689 2949.6984 2949.8915 2951.0964 2951.4897 2952.8350 2954.0112 2957.9324 2962.3872 2966.3692 2969.3936 2971.5730 2982.7263 2985.0530 2986.7251 2988.4206 2993.0217 2996.2827 2999.2328 3008.1262 3018.0737 3027.0495 3031.7920 3037.7966 3044.0293 3062.4830 3068.1431 3070.3721 3512.4918
redmass: 4.6452 4.6780 3.7618 3.5969 4.0389 1.7522 2.6786 1.6552 2.4673 4.2703 1.7339 2.2308 5.1487 1.8414 2.1146 1.9506 3.9794 1.1365 3.8256 4.4267 3.4037 4.0098 3.1722 3.3042 3.1648 1.7625 3.0871 4.6605 1.3314 1.0591 1.0628 1.0812 1.1071 1.1488 1.2018 1.2462 1.2742 4.8292 1.9033 1.2682 1.2361 5.5467 4.4437 1.1713 4.5286 3.0307 1.0753 3.6438 2.7886 2.6604 2.6383 2.0309 2.1619 2.2564 2.6786 1.4418 3.1636 1.9101 1.6277 1.2639 1.4493 1.3252 1.3950 1.3379 1.3822 1.2534 1.0278 1.3703 1.1228 1.0680 1.0824 1.1146 1.1045 1.1127 1.3907 1.4331 1.4916 1.5996 1.6779 1.6609 1.6388 1.8384 1.2172 1.0845 1.0730 1.0727 1.0691 1.0714 1.0636 1.0804 1.0820 1.0426 1.0835 1.0886 1.0934 1.0962 1.0983 8.2272 1.0585 1.0584 1.0590 1.0588 1.0591 1.0595 1.0595 1.0591 1.0585 1.0583 1.0368 1.0959 1.0967 1.0612 1.0979 1.0996 1.0596 1.1016 1.1033 1.1042 1.1033 1.1014 1.1044 1.1045 1.1032 1.1007 1.0993 1.0639
irintensity: 0.0060 0.0870 0.5249 0.0816 0.2729 0.1168 0.0180 0.0919 0.0159 0.7146 0.0619 0.0219 0.1697 0.0225 0.0005 0.0160 0.6035 0.0008 1.3787 1.6647 0.2580 5.9202 0.4622 13.0141 2.2623 30.3244 12.7568 14.0322 127.1876 14.8070 4.8087 14.3129 0.0362 4.3546 0.2922 3.2227 0.1249 1.3159 4.6196 1.8143 0.0139 8.9864 24.2572 0.7169 51.0282 64.6966 0.0019 45.5621 77.4838 10.3351 12.6383 0.0220 2.1499 0.5205 5.8336 0.5050 19.8876 0.0611 0.1079 35.0143 0.0005 1.9938 0.1687 0.0439 6.6401 0.1467 0.0193 9.5029 0.1860 0.2148 0.0023 0.2954 0.0615 0.0051 10.6294 11.9758 6.5960 6.0784 1.0116 0.4734 1.7123 30.8751 11.1934 27.7646 0.0002 0.0595 0.1125 0.1640 0.0560 0.1611 1.7703 12.3100 1.1471 1.9946 2.8065 1.6241 46.1865 208.3462 0.0006 0.0263 1.4687 0.4709 4.6969 0.1556 3.5761 1.2012 126.8215 227.9970 35.0981 0.0703 0.2345 5.2589 0.6569 0.7913 41.0749 0.7931 1.1143 0.3946 8.8770 0.7004 1.0421 283.1830 91.9720 102.6778 55.6101 17.5693
temp: 298.150 k
press: 1.00000 atm
elementType: 8 8 6 6 6 6 6 6 6 6 6 6 6 6 6 6 1 1 1 1 1 1 1 1 1 1 1 1 1 1 1 1 1 1 1 1 1 1 1 1 1 1 1 1
symmnumber: 1
zpe: 1036930.2 jmol-1
zpe.correction: 0.394946 hartree
zpe.thermalcorrener: 0.415994 hartree
zpe.thermalcorrenthalpy: 0.416938 hartree
zpe.thermalcorrgfe: 0.341088 hartree
zpe.sumelectzpe: -699.418589 hartree
zpe.sumelectthermal: -699.397541 hartree
zpe.sumelectthermalent: -699.396596 hartree
zpe.sumelectthermalfe: -699.472446 hartree
dipole: 0.4940 -1.4364 0.0123
dipole: 1.5190
quadrupole: -104.2019 -108.9709 -99.8040
quadrupole: 9.8934 -0.0733 0.0546
quadrupole: 0.1237 -4.6453 4.5216 9.8934 -0.0733 0.0546
hfenergy: -699.8135344 hartree
pointgroup: C01 [X(C14H28O2)]
dipole: 0.1952798 0.5644624 -0.0197703 debye
polarizability: 216.5096165|-0.4490456|141.6335019|-0.135312|-0.5370067|122.6916168 unknown
InChI: InChI=1S/C14H28O2/c1-2-3-4-5-6-7-8-9-10-11-12-13-14(15)16/h15H,2-13H2,1H3
charge 0 multiplicity 1
44 atoms
O  -8.364733 0.72478 -0.007086
O  -7.393333 -1.381601 0.073173
C  1.762665 0.452177 -0.010995
C  0.452184 -0.366779 0.000257
C  3.03433 -0.425832 -0.002047
C  -0.818804 0.512152 -0.008653
C  4.344597 0.393568 -0.013269
C  -2.129107 -0.306822 0.004171
C  5.616737 -0.483989 -0.003623
C  -3.398993 0.573494 -0.00536
C  6.927034 0.335421 -0.015548
C  -4.703832 -0.252579 0.010907
C  8.199271 -0.542824 -0.004715
C  -5.957239 0.642663 -0.000962
C  9.503222 0.284239 -0.01764
C  -7.254972 -0.140051 0.026231
H  1.779004 1.129043 0.868991
H  1.776963 1.108086 -0.906759
H  0.435816 -1.043648 -0.879603
H  0.437904 -1.022565 0.895993
H  3.020372 -1.081734 0.893687
H  3.018332 -1.102764 -0.881946
H  -0.801217 1.189603 0.870872
H  -0.804398 1.167191 -0.905061
H  4.360399 1.070884 0.86638
H  4.358833 1.049176 -0.909251
H  -2.146401 -0.984624 -0.874643
H  -2.143613 -0.961201 0.900622
H  5.600871 -1.161699 -0.8830
H  5.60293 -1.139211 0.892686
H  -3.383246 1.226328 -0.903493
H  -3.378311 1.252435 0.873108
H  6.944213 1.013695 0.863394
H  6.942891 0.99007 -0.912257
H  -4.725703 -0.904123 0.905426
H  -4.729169 -0.932808 -0.862018
H  8.180719 -1.220681 -0.882611
H  8.182527 -1.196007 0.891751
H  -5.973639 1.294858 -0.896381
H  -5.961411 1.332378 0.866361
H  9.559024 0.948747 0.865394
H  9.558133 0.922307 -0.920022
H  10.397449 -0.366013 -0.008462
H  -9.199297 0.18166 0.014403
