program: Gaussian 09
title: 000098068
version: EM64L-G09RevD.01
frameworkgroup: C1[X(C8H7FO3)]
method: RPBEPBE
basis: SDD
operation: Freq
keyword: #pfreq=noraman
keyword: PBEPBE/SDD
title: #p freq=noraman PBEPBE/SDD
converged: YES YES NO NO
title: Mulliken charges:
elementType: F O O O C C C C C C C C H H H H H H H
charge: -0.205616 -0.449446 -0.402541 -0.234046 0.367580 -0.266913 -0.344690 -0.319593 -0.355810 -0.359435 0.319070 0.165998 0.273252 0.276143 0.262311 0.257653 0.256395 0.367905 0.391784
chargesum: 0.00000
title: Mulliken charges with hydrogens summed into heavy atoms:
elementType: F O O O C C C C C C C C
charge: -0.205616 -0.081540 -0.010757 -0.234046 0.367580 0.006339 -0.068547 -0.057282 -0.098158 -0.103040 0.319070 0.165998
polarizability: 1.18807413e+02 -1.37092057e+00 9.81997993e+01 1.77681179e+00 9.45595431e+00 5.65129267e+01
1716.lowfreq: -6.9592 -0.0008 0.0001 0.0003 4.8710 9.1423 24.4820 56.5576 92.5325
frequency: 24.2204 56.5558 92.5118 155.8255 206.6754 272.9073 323.6710 343.7974 372.4183 393.5856 416.2705 422.0543 503.2639 536.2942 577.7040 620.4223 629.8159 665.9602 702.6777 778.6553 810.1940 823.4896 857.4808 872.3917 953.3006 975.2418 1005.8859 1015.4384 1068.9900 1107.1160 1156.2282 1170.3789 1200.6698 1214.0426 1264.6713 1293.4772 1299.7642 1368.2385 1393.3039 1404.1826 1490.1680 1603.4258 1610.6626 1648.4031 3028.7442 3150.7617 3164.0478 3176.8522 3183.1313 3470.1850 3508.9686
redmass: 4.5439 12.0628 7.7249 7.7625 7.8299 6.5173 6.7333 6.1801 1.2896 5.3626 2.6381 4.5865 2.7284 4.5837 1.9281 3.9714 6.3304 2.8215 3.7321 5.0366 2.2885 1.3122 3.0287 2.9934 1.3665 1.3385 2.9748 4.8836 2.2491 1.2996 1.4431 2.3016 2.8004 1.3389 1.4145 1.2965 1.6673 2.2681 3.0896 2.7773 2.5802 7.8286 6.4110 8.7907 1.0842 1.0891 1.0883 1.0963 1.0970 1.0652 1.0641
irintensity: 0.6856 1.6511 0.2896 3.9878 5.2421 4.9247 17.0106 14.7876 106.9647 0.9104 14.2259 11.1084 11.1428 25.1931 110.7777 31.0360 5.4624 82.0276 4.1736 25.0963 48.9639 1.0336 23.9261 42.3116 0.7146 1.2162 23.1786 181.6908 119.7867 12.3179 38.0696 20.0699 46.9806 18.1462 32.2724 2.7284 49.0830 16.9108 7.2185 7.1039 116.6504 6.6967 15.0114 224.5079 9.8698 2.6502 0.5383 3.2826 3.7664 41.1484 33.2035
temp: 298.150 k
press: 1.00000 atm
elementType: 9 8 8 8 6 6 6 6 6 6 6 6 1 1 1 1 1 1 1
symmnumber: 1
zpe: 355201.9 jmol-1
zpe.correction: 0.135289 hartree
zpe.thermalcorrener: 0.146048 hartree
zpe.thermalcorrenthalpy: 0.146993 hartree
zpe.thermalcorrgfe: 0.097450 hartree
zpe.sumelectzpe: -633.685731 hartree
zpe.sumelectthermal: -633.674972 hartree
zpe.sumelectthermalent: -633.674028 hartree
zpe.sumelectthermalfe: -633.723571 hartree
dipole: -1.6747 -2.2054 0.1708
dipole: 2.7744
quadrupole: -75.9796 -60.5535 -71.8492
quadrupole: 8.0372 -0.7117 2.4237
quadrupole: -6.5189 8.9072 -2.3884 8.0372 -0.7117 2.4237
hfenergy: -633.8210206 hartree
pointgroup: C01 [X(C8H7F1O3)]
dipole: 0.6191528 0.8982487 0.0355831 debye
dipolederiv: -1.138569 0.0527108 0.2051994 0.0673633 -0.2090342 -0.0007021 0.2340856 0.0010797 -0.2062087 -0.717608 0.1048896 0.1053234 0.2009731 -0.601847 0.0194936 0.1031973 -0.0040786 -0.2698891 -0.4066702 -0.055179 0.0880813 -0.0725818 -1.1571844 0.204626 0.0539703 0.1254883 -0.3134908 -0.6578698 0.1326653 -0.2645271 -0.0301432 -0.6634647 0.0196672 -0.46796 0.1892907 -0.6132836 0.1834474 0.0632925 0.0148325 -0.0639185 -0.2021537 -0.0320545 -0.1388763 -0.0447379 -0.1103719 0.282038 -0.247922 -0.1911195 -0.3243061 0.4026 -0.0219359 -0.0722197 -0.1007718 0.2029923 -0.0636926 -0.0119333 -0.054093 0.0050851 0.0644989 -0.0324466 -0.0541906 -0.0193588 -0.1028876 -0.0225979 -0.0060726 -0.0395989 0.0177895 0.06959 -0.0503884 -0.0393324 -0.0336889 -0.1189843 -0.2018475 0.0336727 -0.008755 0.1784155 -0.0434535 -0.0725164 -0.0181917 -0.0351706 -0.1325425 -0.2172297 -0.0172179 0.0102422 -0.1734777 -0.0311393 -0.0004539 0.0680051 -0.0298636 -0.1574916 1.2221587 -0.0688711 -0.2491161 -0.0713206 0.2538781 -0.0271557 -0.2745348 -0.0239947 0.1639162 0.7640579 0.00331 0.4308618 0.2559343 1.3345377 -0.1863182 0.6936307 -0.2373513 0.6982644 0.0010118 0.0170321 0.0319683 0.0224767 0.0114837 0.0586771 0.0407114 0.0681899 -0.0237269 0.1267072 0.0596456 -0.003454 0.0473931 0.0170656 0.0276299 -0.0136293 0.0182513 0.1456451 0.0865534 -0.0601469 0.0504305 -0.0609094 0.0110555 0.0447742 0.0394006 0.0435693 0.1261328 0.044674 -0.0532511 0.0441264 -0.0596932 0.0209958 0.056666 0.0536993 0.0540668 0.1548202 0.0483507 0.0671307 0.0106665 0.0793995 0.0026016 0.030599 0.0158381 0.0311516 0.1685392 0.3712662 0.016391 -0.0471047 -0.0307773 0.3889601 -0.0157091 -0.0635943 0.0545838 0.162051 0.2958194 -0.0301464 -0.1339641 0.0122978 0.3310098 -0.0224522 -0.1600095 -0.056655 0.2265157 unknown
polarizability: 118.6499503|-0.8261338|98.0285024|-4.0876418|-9.6916987|56.8416863 unknown
InChI: InChI=1S/C8H7FO3/c9-6-3-1-5(2-4-6)7(10)8(11)12/h1-4,7,10-11H
charge 0 multiplicity 1
19 atoms
F  -3.969196 0.101449 0.559573
O  2.082296 -1.669894 -0.730169
O  2.375228 1.918671 -0.152752
O  3.17418 0.095793 1.051942
C  0.110433 -0.179197 -0.42343
C  1.601592 -0.300772 -0.798895
C  -0.584282 -1.314533 0.053927
C  -0.577724 1.050414 -0.58103
C  -1.954034 -1.229625 0.390325
C  -1.946491 1.152458 -0.252867
C  -2.601832 0.005847 0.229878
C  2.465031 0.564419 0.133061
H  1.749891 0.050958 -1.835936
H  -0.049778 -2.264755 0.1356
H  -0.045196 1.932442 -0.951494
H  -2.508914 -2.097096 0.759073
H  -2.496604 2.09084 -0.36708
H  2.594859 -1.773674 0.11868
H  2.920843 2.444452 0.493593
