program: Gaussian 09
title: 000098065
version: EM64L-G09RevD.01
frameworkgroup: C1[X(C8H10OS)]
method: RPBEPBE
basis: SDD
operation: Freq
keyword: #p
keyword: freq=noraman
keyword: PBEPBE/SDD
title: #p freq=noraman PBEPBE/SDD
converged: YES YES NO NO
title: Mulliken charges:
elementType: S O C C C C C C C C H H H H H H H H H H
charge: 0.274869 -0.420243 -0.169848 -0.508896 -0.498904 -0.084916 -0.199514 -0.263988 -0.142710 -0.516729 0.252025 0.237745 0.238149 0.232456 0.240048 0.229456 0.329379 0.265467 0.243247 0.262906
chargesum: 0.00000
title: Mulliken charges with hydrogens summed into heavy atoms:
elementType: S O C C C C C C C C
charge: 0.274869 -0.090864 0.082177 -0.033003 -0.026400 0.144541 -0.199514 0.001479 0.100538 -0.253823
polarizability: 1.29744854e+02 -1.98400303e+00 1.04127094e+02 4.45466603e-01 -5.09251466e+00 6.30682997e+01
1716.lowfreq: -9.3078 -0.0005 0.0022 0.0026 6.8806 15.3586 42.8679 71.1687 131.3278
frequency: 42.7010 70.9228 131.3258 156.0804 203.5162 281.0059 317.6962 324.8161 396.6996 439.5407 502.1954 561.9549 613.3989 678.6038 702.6922 724.3176 769.1596 813.6733 819.8901 836.9287 851.1265 898.9599 909.5541 934.2282 965.6158 1034.8005 1043.3025 1063.4876 1076.4679 1108.5529 1112.2223 1165.8659 1168.3313 1202.8347 1222.2396 1227.5910 1272.0612 1333.1452 1359.9785 1390.4079 1445.9226 1472.1685 1478.4940 1551.6236 3010.4358 3093.6700 3100.7861 3109.1917 3168.1019 3185.8625 3191.7778 3211.3325 3233.8254 3539.1878
redmass: 5.7609 3.1617 3.1873 4.2638 4.0733 3.7352 1.2807 3.8730 3.1893 4.4132 4.1996 3.1867 7.5462 5.9865 1.1812 3.2560 1.2793 2.1359 1.7403 1.5963 1.8807 4.5083 1.3768 2.8994 2.9911 1.7098 1.2386 1.2569 1.3264 1.2497 1.4135 1.4619 2.0987 1.7737 1.3779 1.4772 1.4183 2.2345 1.1749 1.7556 1.0895 1.3209 6.5782 6.0634 1.0837 1.0531 1.0721 1.0783 1.0894 1.0976 1.1169 1.1148 1.1003 1.0660
irintensity: 0.7017 0.1531 0.3964 0.2746 0.1904 2.8818 92.7221 6.0827 78.3082 2.0090 8.8562 1.9339 2.4794 0.8622 101.3322 26.9748 2.0487 17.4035 7.2383 21.0559 13.0302 28.0383 0.4926 17.6003 86.2391 7.7232 30.1095 8.4676 3.3438 2.3979 1.0249 4.4222 11.4507 2.4343 25.7744 33.3148 13.9814 0.0331 31.2295 9.8791 11.3074 2.4861 7.3561 1.1235 14.1489 18.1030 18.4172 5.6354 7.5736 4.3975 1.1271 25.0337 1.2991 6.4262
temp: 298.150 k
press: 1.00000 atm
elementType: 16 8 6 6 6 6 6 6 6 6 1 1 1 1 1 1 1 1 1 1
symmnumber: 1
zpe: 415823.6 jmol-1
zpe.correction: 0.158379 hartree
zpe.thermalcorrener: 0.168307 hartree
zpe.thermalcorrenthalpy: 0.169251 hartree
zpe.thermalcorrgfe: 0.122319 hartree
zpe.sumelectzpe: -783.320666 hartree
zpe.sumelectthermal: -783.310739 hartree
zpe.sumelectthermalent: -783.309794 hartree
zpe.sumelectthermalfe: -783.356726 hartree
dipole: 0.2605 2.3859 -1.0416
dipole: 2.6164
quadrupole: -61.5127 -69.5793 -65.5135
quadrupole: 1.0341 -0.6205 -0.0741
quadrupole: 4.0224 -4.0441 0.0216 1.0341 -0.6205 -0.0741
hfenergy: -783.4790452 hartree
pointgroup: C01 [X(C8H10O1S1)]
dipole: -0.0258186 -0.4095412 0.944034 debye
dipolederiv: -0.1026665 0.0316239 -0.0080737 0.0823822 0.0179796 0.1744309 -0.0413769 0.1695866 -0.1536074 -0.7571082 -0.0792344 -0.0667901 -0.0695684 -0.7027504 0.2208358 -0.1468378 0.2416356 -0.2356163 -0.2403057 0.206744 -0.0689898 0.1503754 -0.079949 0.0395261 0.0326337 0.066078 0.0606477 -0.1864884 -0.0327817 0.0625878 -0.1139199 0.0593175 0.0108865 0.0271279 0.0415504 0.083496 0.0676596 -0.0529644 0.0309865 -0.0371096 -0.1659029 0.0336001 -0.0210389 0.0855383 0.0755661 0.7266568 -0.0068961 0.0141596 0.1218948 0.667209 -0.0796283 0.0844527 -0.1459247 0.2539047 0.0611416 -0.1822839 0.1874653 -0.2002646 -0.1953803 -0.1952014 0.1502512 -0.1935451 0.1457512 -0.0451754 -0.0516623 0.0830796 -0.0147948 -0.1420928 0.0179756 0.0033243 0.0259972 -0.1938956 -0.0289683 0.0608926 -0.1163602 0.038054 -0.1443829 -0.0115515 -0.0445588 -0.0067215 -0.1426154 -0.1337687 0.0798852 -0.1317321 0.0584305 -0.1449028 -0.2846202 -0.1181867 -0.2611457 0.0846633 0.0306019 0.0760913 0.0370944 0.0763358 0.0154384 -0.0746525 0.0075006 -0.0702908 -0.0550213 -0.0809922 -0.0540485 -0.0638306 -0.0558319 0.0857969 -0.0250101 -0.0930443 -0.0415677 0.0082149 0.0642682 -0.0263945 0.0116625 -0.0399098 0.1035264 0.0134032 0.0793057 0.0089473 -0.0792025 0.1035307 -0.0722909 -0.0458817 -0.0522367 -0.0212549 -0.0438457 -0.0436596 -0.0871193 -0.0121913 0.0963827 0.0023928 -0.0244919 0.0177963 0.0019646 0.066946 -0.040622 0.0957524 -0.0702366 -0.0518531 0.0233323 0.0551947 -0.019174 -0.027446 -0.0493726 0.0726897 -0.0565786 -0.0449874 0.3792341 0.0628096 0.0694541 0.051283 0.2634061 -0.0739057 0.0893069 -0.1266216 0.0563777 0.0795811 0.0427796 -0.0668622 0.0720555 0.1131278 0.0879067 -0.1049023 0.0851002 0.0574409 0.0490343 -0.0377751 0.0534381 -0.0619234 0.1229702 0.1070494 0.0955166 0.1090136 0.0318943 -0.0307644 0.0097807 -0.0121105 -0.0038745 0.1733254 0.0652276 0.012118 0.0603156 0.1294169 unknown
polarizability: 129.8151458|-1.7464749|79.9535422|0.3173427|-20.7870456|87.1715599 unknown
InChI: InChI=1S/C8H10OS/c9-8(6-3-4-6)7-2-1-5-10-7/h1-2,5-6,8-9H,3-4H2
charge 0 multiplicity 1
20 atoms
S  -1.966748 0.870445 -1.234412
O  1.008216 1.814571 -1.1014
C  1.785716 0.068797 0.501454
C  3.248463 -0.20728 0.142969
C  2.346054 -1.363114 0.596597
C  0.809896 0.425992 -0.61191
C  -0.629846 0.198559 -0.204025
C  -1.15107 -0.519053 0.863914
C  -2.593994 -0.559079 0.899174
C  -3.186584 0.132289 -0.144261
H  1.593896 0.588854 1.448778
H  4.021699 0.145634 0.830893
H  3.527721 -0.1508 -0.913328
H  2.018801 -2.086161 -0.157701
H  2.505974 -1.791619 1.590175
H  1.053377 -0.168887 -1.513493
H  0.754394 2.437903 -0.371929
H  -0.513834 -1.014455 1.600441
H  -3.166141 -1.076741 1.67311
H  -4.244189 0.281542 -0.355746
