program: Gaussian 09
title: 000098060
version: EM64L-G09RevD.01
frameworkgroup: C1[X(C9H14N2)]
method: RPBEPBE
basis: SDD
operation: Freq
keyword: #pfreq=noraman
keyword: PBEPBE/SDD
title: #p freq=noraman PBEPBE/SDD
converged: NO YES NO NO
title: Mulliken charges:
elementType: N N C C C C C C C C C H H H H H H H H H H H H H H
charge: -0.364875 -0.576924 -0.154858 0.444306 -0.443920 -0.382809 -0.453681 -0.640151 -0.231808 -0.227529 -0.245448 0.208445 0.193983 0.211385 0.254448 0.273206 0.251050 0.194396 0.245832 0.216134 0.273041 0.285329 0.222030 0.223183 0.225234
chargesum: 0.00000
title: Mulliken charges with hydrogens summed into heavy atoms:
elementType: N N C C C C C C C C C
charge: -0.110427 -0.018553 0.053588 0.444306 -0.038551 -0.109604 -0.202631 0.016211 -0.009778 -0.004346 -0.020214
polarizability: 1.33613663e+02 -6.46837115e-01 9.25110754e+01 1.56633801e+00 1.43536408e+01 9.26295235e+01
1716.lowfreq: -14.4682 -11.4708 -0.0004 0.0003 0.0005 8.0662 49.3837 81.7777 103.0222
frequency: 49.2035 81.7695 103.0174 146.3104 172.2397 185.9515 228.8758 241.9039 268.7606 383.6270 406.8604 419.0198 449.4601 543.8021 572.8640 613.2688 622.6136 676.4809 709.2898 756.1170 772.9875 861.7289 920.7051 927.3763 971.7010 982.4357 989.4420 999.1419 1023.5581 1032.2563 1075.5293 1103.8743 1106.8317 1129.9140 1150.5660 1153.7497 1168.7242 1178.1593 1218.9870 1262.5876 1290.5811 1299.0040 1342.8888 1374.5738 1387.6188 1432.9212 1442.0100 1454.5009 1467.4912 1477.8679 1483.7150 1498.1149 1592.5678 1610.7252 1634.7708 2875.7023 2881.2820 2903.3861 3001.9173 3024.5564 3079.6485 3116.1260 3122.2751 3134.9064 3144.4070 3159.2092 3457.7830 3464.9938 3593.4447
redmass: 3.6080 3.7258 2.7222 2.0137 2.3714 1.5995 1.2126 1.9252 2.9457 3.6865 2.8781 2.9127 4.2235 2.4652 2.4699 3.0730 1.6586 1.8711 1.7924 2.7230 1.8765 1.2475 1.7772 1.3964 2.3220 1.4205 4.8224 1.3479 2.1470 2.7674 1.5723 1.7013 1.3361 1.8382 2.0981 3.0687 1.0623 1.1162 1.8582 1.4440 1.3270 1.3162 1.4240 1.4763 4.4011 1.2416 1.8511 1.2617 1.1030 1.4618 1.3981 1.0592 6.0949 6.0352 1.0942 1.0780 1.0576 1.0688 1.0932 1.0747 1.1006 1.0845 1.0875 1.0918 1.0958 1.1014 1.0744 1.0453 1.0974
irintensity: 1.7294 0.5698 0.9969 8.2469 2.0798 3.9579 72.1565 23.9157 7.6621 10.1652 0.6032 2.7948 1.1095 29.0398 23.6356 65.3586 167.0626 31.5260 51.5361 1.9693 45.5608 0.6980 6.2344 4.1320 8.9260 0.4076 0.0456 1.3106 6.7014 2.7609 9.0689 19.7352 2.0132 4.5023 18.1645 23.2888 0.3045 0.4113 13.5136 4.2726 5.4135 6.4752 10.3354 7.5307 3.2867 4.1483 22.2221 11.1798 3.0766 4.0017 8.3691 11.8458 0.4036 4.9981 47.5661 16.4814 133.5910 116.8517 67.6079 39.5826 36.8665 2.6418 2.4663 17.3752 32.2909 28.1696 2.7105 0.9551 1.8072
temp: 298.150 k
press: 1.00000 atm
elementType: 7 7 6 6 6 6 6 6 6 6 6 1 1 1 1 1 1 1 1 1 1 1 1 1 1
symmnumber: 1
zpe: 564701.3 jmol-1
zpe.correction: 0.215083 hartree
zpe.thermalcorrener: 0.226515 hartree
zpe.thermalcorrenthalpy: 0.227459 hartree
zpe.thermalcorrgfe: 0.177826 hartree
zpe.sumelectzpe: -459.993759 hartree
zpe.sumelectthermal: -459.982328 hartree
zpe.sumelectthermalent: -459.981383 hartree
zpe.sumelectthermalfe: -460.031016 hartree
dipole: -0.8084 0.4390 -0.4493
dipole: 1.0237
quadrupole: -58.2295 -64.8482 -66.9859
quadrupole: 0.6726 0.9104 -1.5919
quadrupole: 5.1250 -1.4937 -3.6313 0.6726 0.9104 -1.5919
hfenergy: -460.2088421 hartree
pointgroup: C01 [X(C9H14N2)]
dipole: -0.3498752 -0.1177238 0.1610961 debye
dipolederiv: -0.2612651 0.0001962 -0.0028716 0.1097321 -0.6650102 0.0782107 0.0098509 0.0531798 -0.6104423 -0.2746684 0.0348176 -0.0177082 -0.0378476 -0.6587216 -0.0856942 -0.0598421 -0.120888 -0.6404509 0.3069974 -0.2826629 0.0896017 -0.2642181 0.4105463 0.0684323 0.1860876 0.0955661 0.3095723 0.2228635 0.0435299 0.0094349 0.0047466 -0.1212927 0.0085716 -0.000511 0.0062386 -0.0833339 0.1627363 -0.0730103 0.014401 0.13275 0.4998134 0.134082 -0.004821 0.020875 0.3217671 -0.1473492 -0.0452211 -0.0537775 -0.0689297 -0.0846609 0.0775909 -0.0601643 0.0638338 -0.0606536 -0.1169522 0.0205089 0.0510203 0.0440798 -0.1084857 0.0942703 0.0503043 0.1071887 -0.0091358 0.1265647 0.1495966 -0.0365027 -0.0030842 0.3306168 -0.1281684 0.0759492 -0.1449081 0.4337011 0.0138688 0.0135789 0.0775929 0.0221311 -0.0825552 0.1193672 0.0722316 0.1167447 0.0451436 0.0182173 -0.0526139 -0.0530263 -0.0724909 -0.0709352 0.1072814 -0.0650981 0.1014885 0.0005919 0.0606773 -0.0295096 0.0305693 -0.0182729 -0.1436791 0.0442604 0.0419623 0.0362101 -0.0976938 -0.0210935 0.0357658 -0.0120899 0.0131657 -0.0505872 -0.0433775 -0.049534 -0.1046511 -0.2109767 -0.2545499 0.0404162 -0.0216122 -0.0090568 0.0271212 -0.0076721 -0.0315694 -0.0045883 0.068512 0.052433 -0.0111072 -0.056086 0.0030024 -0.071487 -0.1103705 0.0108017 -0.0900538 -0.205959 -0.0790921 -0.0028242 0.0456909 -0.0318205 0.1079659 0.052282 -0.0832388 0.035926 0.2780521 0.0894661 0.0415325 0.0779846 0.0357264 0.0844317 -0.0748657 0.071355 -0.0758127 0.0627196 0.057786 -0.0343007 -0.0893891 -0.0234761 0.0960575 -0.0765413 -0.070446 -0.0845154 -0.0070372 0.0506318 -0.0231259 -0.055798 -0.0262675 -0.0059741 -0.0434185 -0.0882659 0.1324191 -0.2990105 -0.1364307 -0.0865332 0.01052 -0.0458471 0.1164388 -0.0009472 -0.0226767 0.0095174 0.0477772 0.0384202 0.1347209 0.0203702 0.1056856 -0.1550024 -0.021154 0.0584639 -0.0612845 0.0528463 0.133973 -0.0317334 0.0743327 -0.0343252 0.0699351 0.0628946 0.1549345 0.1690324 0.2731373 0.0730279 0.0806555 -0.0512058 0.0869364 0.1805876 -0.0118336 -0.1386362 -0.0215089 0.2504349 0.0314957 -0.0273805 -0.0785734 -0.0348012 0.0858638 -0.1107112 -0.096404 -0.1061337 -0.0382227 -0.0039307 0.0752975 0.071748 0.0861685 0.0739691 -0.1028834 0.082927 -0.1046731 0.0145188 -0.143827 0.0294067 -0.0446256 0.0263134 0.1350441 -0.0296058 -0.0436607 -0.0292029 0.1041423 unknown
polarizability: 132.7079211|-6.0672805|94.3591961|3.2073321|14.0206239|91.6871443 unknown
InChI: InChI=1S/C9H14N2/c1-11-9(7-10)8-5-3-2-4-6-8/h2-6,9,11H,7,10H2,1H3
charge 0 multiplicity 1
25 atoms
N  -2.004745 1.389987 -0.019321
N  -1.776204 -2.37295 0.072718
C  -1.472291 0.061972 -0.396696
C  0.04237 -0.008581 -0.179303
C  -2.192969 -1.016598 0.466641
C  0.634527 0.608726 0.952501
C  0.865983 -0.742238 -1.069068
C  -1.591126 2.508274 -0.887144
C  2.021528 0.492668 1.189978
C  2.25558 -0.863595 -0.8310
C  2.837941 -0.246496 0.300071
H  -1.68144 -0.19775 -1.463714
H  -3.283685 -0.932419 0.285868
H  -2.012509 -0.762862 1.537945
H  -3.023279 1.360419 0.11359
H  -0.009392 1.193365 1.61981
H  0.415327 -1.21644 -1.949423
H  -1.845673 2.366127 -1.965758
H  -0.497116 2.644388 -0.820383
H  -2.066935 3.442472 -0.53917
H  -2.386464 -3.118567 0.416502
H  -0.785998 -2.566108 0.252934
H  2.468781 0.978813 2.06508
H  2.881378 -1.432369 -1.528581
H  3.915109 -0.334538 0.483025
