program: Gaussian 09
title: 000098046
version: EM64L-G09RevD.01
frameworkgroup: C1[X(C11H15NO3)]
method: RPBEPBE
basis: SDD
operation: Freq
keyword: #p
keyword: freq=noraman
keyword: PBEPBE/SDD
title: #p freq=noraman PBEPBE/SDD
converged: YES YES NO NO
title: Mulliken charges:
elementType: O O O N C C C C C C C C C C C H H H H H H H H H H H H H H H
charge: -0.262572 -0.458489 -0.287597 -0.431657 0.491325 -0.150717 0.142998 0.343534 -0.463160 -0.323256 -0.329686 -0.369543 -0.661156 -0.245449 -0.683541 0.220568 0.307547 0.217735 0.309994 0.247056 0.252503 0.236856 0.183367 0.252932 0.207160 0.207280 0.207308 0.233436 0.233341 0.371883
chargesum: 0.00000
title: Mulliken charges with hydrogens summed into heavy atoms:
elementType: O O O N C C C C C C C C C C C
charge: -0.262572 -0.086606 -0.287597 -0.124110 0.491325 0.069851 0.142998 0.343534 -0.245425 -0.013262 -0.082630 -0.117040 0.011999 0.168991 -0.009457
polarizability: 2.34484037e+02 -4.00673078e+00 1.30891398e+02 -1.22529579e+00 -6.62720672e+00 7.72483321e+01
1716.lowfreq: -4.4032 -0.0009 -0.0008 -0.0005 4.8388 7.9922 31.3917 34.6137 61.7968
frequency: 31.2255 34.4726 61.7819 80.0555 85.9221 119.3588 151.8392 164.6462 207.1186 220.9719 240.0246 274.0996 306.8763 356.0735 369.6120 381.7435 411.1209 415.4100 431.4997 474.4303 524.4849 575.0559 620.7680 641.8933 648.3689 714.9726 723.5070 742.3933 799.1213 823.0168 833.2077 852.8615 864.8811 902.7579 915.7948 920.2883 986.5968 999.4206 1018.9064 1036.8055 1074.8618 1110.1607 1115.7308 1125.8500 1136.0781 1180.6394 1187.6432 1219.7038 1233.4898 1263.0399 1265.9253 1307.2969 1315.3983 1358.4628 1369.6486 1387.6112 1391.9515 1401.7733 1426.6285 1455.9410 1460.6435 1474.4569 1477.8489 1487.7373 1502.5181 1521.8992 1593.6560 1611.0922 1630.1373 2952.7009 2960.6526 2983.3730 2998.4060 3010.5043 3080.9276 3095.5726 3107.0062 3107.5792 3111.7691 3163.0804 3169.3104 3196.2439 3379.3301 3518.8506
redmass: 3.5898 3.9761 6.7376 4.2749 4.6907 1.7099 4.1180 4.2182 4.6907 1.1094 1.2281 3.9525 3.8940 4.5927 6.8357 4.6991 3.2248 3.1586 3.0212 1.2425 2.3417 5.8340 6.0084 1.2958 4.1075 3.3887 3.6255 4.4358 1.3553 5.3704 1.1103 1.4914 3.5158 3.3151 2.7972 1.3865 1.3107 2.7582 1.9367 2.8100 2.7820 2.1337 2.1428 1.3310 1.4335 1.4827 1.7662 2.4328 1.4948 1.1523 2.2894 1.3745 1.2475 2.0795 1.3687 1.5172 1.5148 1.3291 3.8160 1.0819 1.0397 1.0538 1.0845 1.1992 1.9097 2.3545 5.8435 4.6815 6.4196 1.0553 1.0832 1.0380 1.0363 1.1075 1.0969 1.0989 1.1012 1.1013 1.0900 1.0905 1.0930 1.0956 1.0641 1.0760
irintensity: 0.5520 0.2319 0.3268 1.6268 0.8086 2.6648 1.7528 0.6093 2.2368 0.1595 0.6992 2.3205 7.4904 29.7822 20.8251 3.6092 20.2004 4.5405 28.2798 68.3310 40.9328 16.0210 2.1615 39.7570 24.0214 8.9900 1.4069 5.1821 48.9469 3.9646 0.2901 66.8549 15.7226 48.4149 5.5568 1.9489 1.9854 3.7259 76.9672 82.2170 84.0489 52.5915 2.2424 24.5490 4.6100 71.9462 21.9437 301.9127 41.8948 0.4868 12.5436 11.9462 3.4009 159.9671 188.3145 25.9007 14.6449 39.3720 0.2969 10.9648 12.0152 12.2368 43.5538 71.7568 77.5332 294.8651 105.0766 131.9662 6.3229 43.3017 40.0911 23.2111 27.0262 38.9743 40.3026 29.0678 22.0791 34.3265 21.4599 3.9971 12.3497 5.6707 73.6960 13.0827
temp: 298.150 k
press: 1.00000 atm
elementType: 8 8 8 7 6 6 6 6 6 6 6 6 6 6 6 1 1 1 1 1 1 1 1 1 1 1 1 1 1 1
symmnumber: 1
zpe: 639323.3 jmol-1
zpe.correction: 0.243505 hartree
zpe.thermalcorrener: 0.259044 hartree
zpe.thermalcorrenthalpy: 0.259989 hartree
zpe.thermalcorrgfe: 0.199588 hartree
zpe.sumelectzpe: -707.457495 hartree
zpe.sumelectthermal: -707.441956 hartree
zpe.sumelectthermalent: -707.441012 hartree
zpe.sumelectthermalfe: -707.501412 hartree
dipole: -4.1227 4.9175 -0.1602
dipole: 6.4191
quadrupole: -94.3765 -83.7531 -92.0913
quadrupole: 4.3567 2.8794 -2.2375
quadrupole: -4.3028 6.3205 -2.0177 4.3567 2.8794 -2.2375
hfenergy: -707.7010003 hartree
pointgroup: C01 [X(C11H15N1O3)]
dipole: -1.6457339 -1.9151018 -0.043144 debye
polarizability: 234.1804834|2.9247735|131.0381362|7.8955601|-5.5108836|77.405148 unknown
InChI: InChI=1S/C11H15NO3/c1-3-15-10-6-4-9(5-7-10)12-11(14)8(2)13/h4-8,12-13H,3H2,1-2H3
charge 0 multiplicity 1
30 atoms
O  -3.774359 0.554169 -0.335751
O  5.21864 0.58023 0.523926
O  2.776353 1.482836 0.03205
N  1.737681 -0.617743 0.258752
C  0.351558 -0.29988 0.105794
C  4.211486 -0.459505 0.399711
C  2.829535 0.22308 0.214211
C  -2.428175 0.193862 -0.178362
C  -0.582359 -1.359568 0.203196
C  -0.116158 1.021677 -0.135574
C  -1.966257 -1.124378 0.063546
C  -1.494274 1.2557 -0.275144
C  4.56086 -1.393434 -0.78196
C  -4.789921 -0.513325 -0.24007
C  -6.148771 0.151538 -0.442046
H  4.199661 -1.041881 1.345405
H  1.941859 -1.60746 0.420521
H  -0.233095 -2.383597 0.390357
H  0.601064 1.840871 -0.208577
H  -2.660125 -1.965439 0.145224
H  -1.871086 2.266005 -0.46109
H  4.49873 -0.845397 -1.737924
H  3.89504 -2.276655 -0.8334
H  5.59706 -1.748717 -0.654424
H  -4.595974 -1.278348 -1.020455
H  -4.722912 -0.998103 0.756047
H  -6.953973 -0.603098 -0.381933
H  -6.326549 0.916425 0.33283
H  -6.199599 0.640337 -1.429779
H  4.752759 1.445999 0.327716
