program: Gaussian 09
title: 000098035
version: EM64L-G09RevD.01
frameworkgroup: C1[X(C11H24O2)]
method: RPBEPBE
basis: SDD
operation: Freq
keyword: #pfreq=noraman
keyword: PBEPBE/SDD
title: #p freq=noraman PBEPBE/SDD
converged: YES YES NO NO
title: Mulliken charges:
elementType: O O C C C C C C C C C C C H H H H H H H H H H H H H H H H H H H H H H H H
charge: -0.458219 -0.439609 -0.384251 -0.381631 -0.382690 -0.363006 -0.372959 -0.414288 -0.353585 -0.060548 -0.356552 -0.373093 -0.696270 0.193971 0.192212 0.197939 0.198359 0.193870 0.193588 0.160872 0.200095 0.189850 0.189445 0.214618 0.218216 0.188141 0.188351 0.179561 0.194828 0.194701 0.224031 0.220652 0.209871 0.215312 0.209872 0.334363 0.333981
chargesum: 0.00000
title: Mulliken charges with hydrogens summed into heavy atoms:
elementType: O O C C C C C C C C C C C
charge: -0.123856 -0.105628 0.001932 0.014667 0.004768 -0.002039 0.006336 0.018546 0.022907 0.119013 0.032977 0.071591 -0.061214
polarizability: 1.63563564e+02 4.09058876e-01 1.12705384e+02 -6.32913143e-01 -8.38724268e-02 1.07909756e+02
1716.lowfreq: -0.0012 -0.0005 0.0013 5.7265 7.7202 16.3833 25.1231 38.3139 48.2041
frequency: 25.0907 38.1837 45.0841 58.2967 81.5626 93.2083 108.2686 117.8211 120.8717 146.8155 150.7608 167.9283 192.1275 233.4833 252.9044 270.5042 292.6816 317.1417 356.6217 407.2487 428.1930 472.6736 494.9084 516.4961 722.9750 726.5104 738.7844 765.4009 809.3646 854.8239 885.0740 889.4365 924.6601 951.1775 969.5642 987.1159 1001.0376 1020.9405 1030.6639 1038.8944 1064.9456 1067.8438 1080.8113 1081.8878 1086.7555 1098.7870 1120.8908 1172.4466 1188.2364 1211.1710 1220.4241 1232.6548 1249.8360 1252.5349 1276.5871 1280.3941 1284.2533 1291.1364 1295.4450 1299.0805 1308.5595 1311.2798 1326.3081 1338.8529 1350.8584 1354.7159 1356.6821 1367.9954 1387.9270 1399.9890 1446.3225 1459.1566 1460.2420 1463.0017 1465.7776 1470.3593 1471.9257 1477.4585 1478.4582 1484.4055 1488.3142 2900.7346 2929.3883 2947.8536 2949.2272 2951.3873 2956.4140 2962.4797 2967.4303 2971.0605 2975.7161 2982.3294 2984.7094 2990.0035 2993.9127 3000.6374 3015.1336 3028.5484 3039.1210 3045.3985 3067.8497 3070.1221 3092.5845 3562.6167 3565.7031
redmass: 4.1825 3.9789 1.8899 3.4660 1.6234 3.7125 2.9568 2.8962 1.7571 2.3006 1.9227 3.8228 2.9463 1.1108 2.2597 1.3002 1.8386 1.5797 3.1747 3.8197 2.8056 3.5998 2.5870 3.2495 1.0598 1.0748 1.1138 1.2067 1.3657 1.7511 1.6070 1.6690 1.5728 3.7795 1.3772 4.6372 4.2623 1.2608 2.3192 3.2037 2.0630 2.6291 2.0377 2.0162 2.0573 1.4258 2.4813 1.7254 1.7084 1.3013 1.4474 1.2394 1.2835 1.3366 1.2125 1.2798 1.0322 1.1174 1.1107 1.1140 1.2560 1.2051 1.2877 1.3820 1.5268 1.6624 1.6293 1.2952 1.2177 1.7192 1.0790 1.0760 1.0740 1.0685 1.0801 1.0829 1.0826 1.0427 1.0836 1.0897 1.0918 1.0833 1.0626 1.0589 1.0589 1.0593 1.0595 1.0592 1.0588 1.0364 1.0638 1.0944 1.0929 1.0986 1.0648 1.1020 1.1042 1.1048 1.1042 1.1029 1.1008 1.0993 1.1007 1.0663 1.0661
irintensity: 0.1945 0.3877 0.3420 0.0774 0.2159 1.8728 0.7724 3.7995 1.4275 0.7137 0.3337 2.0271 4.5076 0.0039 29.3408 106.1973 61.8768 125.3689 7.0350 7.4248 9.3105 1.5125 3.5127 4.3685 16.1348 0.0166 4.6285 0.5352 0.8474 8.5308 3.6897 2.0984 4.0460 155.5802 2.2752 6.4934 5.6435 3.3991 3.9586 2.6044 15.5294 3.0492 1.1880 0.6769 7.7323 15.0342 14.7203 15.4893 3.2118 7.8120 0.9431 39.6317 1.5070 1.3797 0.3747 0.4689 0.6003 0.1555 0.0761 0.1756 1.0335 12.5531 18.3085 5.8376 1.2090 0.7135 0.7585 5.7630 11.2704 18.1477 5.0913 0.3451 0.2716 0.2420 0.5832 5.6300 3.0934 12.4261 1.8251 4.6751 29.8404 67.5293 31.9993 1.1397 1.9770 0.1262 1.8594 50.0377 167.9211 38.4142 27.6699 6.5440 12.6343 3.1556 54.3580 0.7639 2.9566 0.1901 72.2499 173.9605 99.7038 54.7420 30.1114 4.7432 1.3201
temp: 298.150 k
press: 1.00000 atm
elementType: 8 8 6 6 6 6 6 6 6 6 6 6 6 1 1 1 1 1 1 1 1 1 1 1 1 1 1 1 1 1 1 1 1 1 1 1 1
symmnumber: 1
zpe: 874352.8 jmol-1
zpe.correction: 0.333023 hartree
zpe.thermalcorrener: 0.350755 hartree
zpe.thermalcorrenthalpy: 0.351699 hartree
zpe.thermalcorrgfe: 0.285459 hartree
zpe.sumelectzpe: -582.887786 hartree
zpe.sumelectthermal: -582.870055 hartree
zpe.sumelectthermalent: -582.869111 hartree
zpe.sumelectthermalfe: -582.935351 hartree
dipole: 1.9641 0.6871 1.5679
dipole: 2.6054
quadrupole: -99.0267 -88.7501 -80.6253
quadrupole: -1.0304 -8.9508 -2.0934
quadrupole: -9.5594 0.7173 8.8421 -1.0304 -8.9508 -2.0934
hfenergy: -583.2208099 hartree
pointgroup: C01 [X(C11H24O2)]
dipole: 0.7786326 -0.3385939 -0.5743122 debye
polarizability: 163.5487923|-0.2024558|112.6192816|1.1633882|-0.6376628|108.0106299 unknown
InChI: InChI=1S/C11H24O2/c1-2-3-4-5-6-7-8-9-11(13)10-12/h11-13H,2-10H2,1H3
charge 0 multiplicity 1
37 atoms
O  -4.4854 -1.756595 0.391846
O  -5.605262 1.640977 -0.59901
C  0.899046 -0.368348 -0.289849
C  -0.399312 0.274063 0.247321
C  2.181887 0.31453 0.235577
C  -1.682785 -0.412832 -0.271753
C  3.480776 -0.32571 -0.304091
C  -2.976791 0.242113 0.263327
C  4.764654 0.352487 0.225038
C  -4.271201 -0.43079 -0.227531
C  6.063267 -0.288126 -0.316364
C  -5.535494 0.369111 0.138104
C  7.341239 0.392821 0.219666
H  0.893768 -0.33349 -1.399564
H  0.91837 -1.443658 -0.013334
H  -0.423264 1.347348 -0.034221
H  -0.392893 0.245114 1.356767
H  2.162849 1.390344 -0.037816
H  2.188595 0.276913 1.345116
H  -1.643559 -1.48783 0.015566
H  -1.690233 -0.388641 -1.381699
H  3.475857 -0.284619 -1.413672
H  3.498161 -1.402584 -0.033937
H  -2.974872 0.228012 1.372414
H  -3.006745 1.305463 -0.047686
H  4.772124 0.310328 1.334531
H  4.749188 1.429607 -0.043881
H  -4.22312 -0.548001 -1.337126
H  6.056221 -0.243886 -1.424779
H  6.076244 -1.364693 -0.0491
H  -5.511132 0.655616 1.201888
H  -6.428808 -0.261736 -0.041777
H  7.388049 0.334201 1.323647
H  8.254564 -0.082826 -0.182906
H  7.366354 1.46329 -0.059386
H  -3.63303 -2.259823 0.368146
H  -5.773812 1.447249 -1.55557
