program: Gaussian 09
title: 000098027
version: EM64L-G09RevD.01
frameworkgroup: C1[X(C12H16O3)]
method: RPBEPBE
basis: SDD
operation: Freq
keyword: #pfreq=noraman
keyword: PBEPBE/SDD
title: #p freq=noraman PBEPBE/SDD
converged: YES YES NO NO
title: Mulliken charges:
elementType: O O O C C C C C C C C C C C C H H H H H H H H H H H H H H H H
charge: -0.276447 -0.237860 -0.266507 -0.034231 -0.410007 -0.295510 -0.710203 -0.710682 0.236833 -0.337199 -0.254906 0.362502 -0.384610 -0.250484 -0.157984 0.204938 0.214119 0.213966 0.237539 0.238110 0.213435 0.211972 0.215408 0.211978 0.213535 0.215456 0.276871 0.272788 0.264124 0.258235 0.264821
chargesum: 0.00000
title: Mulliken charges with hydrogens summed into heavy atoms:
elementType: O O O C C C C C C C C C C C C
charge: -0.276447 -0.237860 -0.266507 0.170708 0.018078 0.180139 -0.069387 -0.069712 0.236833 -0.060328 0.017883 0.362502 -0.120486 0.007751 0.106836
polarizability: 2.73045124e+02 -6.53879332e+00 1.27750439e+02 4.62916952e-01 -4.45476580e-02 8.51649858e+01
1716.lowfreq: -10.5656 -0.0009 -0.0005 -0.0002 5.3745 7.2521 22.5142 25.8307 44.0085
frequency: 21.6184 25.1599 43.9645 63.0251 86.8408 102.8276 105.6413 138.3543 187.0276 217.2603 229.2575 236.0178 249.4168 304.2754 335.6837 339.5572 358.8211 383.9021 488.0731 560.2304 586.1448 630.3466 656.0457 697.9617 741.3508 749.7340 775.3262 799.0339 818.8728 869.0741 879.2265 883.0699 893.3494 896.5441 911.7497 953.1637 958.6111 976.0051 988.0393 991.0388 1019.8260 1025.6313 1052.8875 1123.5236 1135.7733 1141.7115 1148.4970 1192.0765 1193.9000 1210.0426 1255.1579 1277.2510 1280.3080 1285.4143 1297.1462 1334.1005 1337.3925 1369.8631 1378.5237 1380.7644 1397.6051 1463.4757 1466.4549 1467.3418 1479.4096 1483.2761 1487.5140 1491.8216 1545.9047 1600.4498 1658.0779 2965.9202 2970.1876 2973.4193 2991.1052 3007.5709 3039.7009 3062.3087 3067.4148 3070.2641 3072.0998 3078.7309 3127.6786 3175.7773 3221.4256 3236.2647 3267.1521
redmass: 3.0838 4.4601 5.1687 5.0664 3.8500 2.1679 4.7449 3.8224 4.3315 5.8680 1.2967 2.2549 1.0577 5.0237 3.1091 3.3434 2.0895 2.7064 3.6231 2.9938 2.9725 4.2518 7.5261 6.1455 1.2639 5.0433 1.1554 3.2348 1.3432 6.6479 4.3886 1.4948 1.7558 5.9400 1.1927 1.2819 2.9018 2.7316 1.7149 1.1336 1.5907 2.0181 2.5951 2.5860 1.6368 2.0179 1.7696 1.6492 1.8189 1.2120 2.3951 1.8389 1.1194 1.5102 1.7394 1.4620 1.3849 2.4698 1.2111 1.5103 1.2248 1.0941 1.0462 4.7816 1.0546 1.0846 1.0509 1.0560 5.5954 11.9254 6.6649 1.0804 1.0353 1.0361 1.0637 1.0563 1.1020 1.1001 1.1006 1.0987 1.0989 1.1070 1.0909 1.0920 1.0926 1.0979 1.1086
irintensity: 0.0092 0.7316 0.9997 2.9661 0.3248 0.3567 0.5824 0.2074 0.1435 0.3831 1.7145 3.0399 0.2166 21.0123 5.2134 0.6690 0.2704 0.8526 7.8312 6.8523 9.1552 2.5625 9.2153 2.2568 86.3449 14.3562 2.7775 9.3324 31.7577 12.3354 15.7098 1.6229 4.3285 12.6093 2.6545 0.1098 27.2969 76.8524 3.7059 55.0078 34.7128 22.5947 79.6361 458.8110 34.8468 25.8924 5.6661 84.5974 9.2092 0.2202 62.8839 59.0514 0.4348 1.2422 96.2865 1.8384 1.0589 18.8293 22.0215 0.9872 15.7956 6.5061 1.5502 31.1372 2.8144 10.1511 13.0718 19.7270 37.8305 287.5168 171.3430 18.9121 40.0703 19.5109 26.5655 27.6979 5.4236 22.8181 7.9182 76.1374 107.3929 49.0199 0.2450 3.9587 4.0694 0.7582 0.0248
temp: 298.150 k
press: 1.00000 atm
elementType: 8 8 8 6 6 6 6 6 6 6 6 6 6 6 6 1 1 1 1 1 1 1 1 1 1 1 1 1 1 1 1
symmnumber: 1
zpe: 666557.9 jmol-1
zpe.correction: 0.253879 hartree
zpe.thermalcorrener: 0.269834 hartree
zpe.thermalcorrenthalpy: 0.270779 hartree
zpe.thermalcorrgfe: 0.207908 hartree
zpe.sumelectzpe: -691.377696 hartree
zpe.sumelectthermal: -691.361740 hartree
zpe.sumelectthermalent: -691.360796 hartree
zpe.sumelectthermalfe: -691.423667 hartree
dipole: 1.6660 -1.3789 0.0261
dipole: 2.1627
quadrupole: -57.5773 -90.7593 -92.5877
quadrupole: 1.9029 0.0402 0.0372
quadrupole: 22.7308 -10.4512 -12.2796 1.9029 0.0402 0.0372
hfenergy: -691.6315742 hartree
pointgroup: C01 [X(C12H16O3)]
dipole: -0.6542032 -0.5432632 -0.0299423 debye
polarizability: 273.0147291|6.8552763|127.7204197|0.6090775|1.6101167|85.2253994 unknown
InChI: InChI=1S/C12H16O3/c1-10(2)7-9-15-12(13)6-5-11-4-3-8-14-11/h3-6,8,10H,7,9H2,1-2H3
charge 0 multiplicity 1
31 atoms
O  1.373195 -0.318613 -0.002208
O  -3.666593 -1.152626 -0.041805
O  0.590274 1.886197 0.089586
C  5.206415 -0.686224 -0.045848
C  3.686171 -1.019619 -0.059953
C  2.77063 0.204479 0.020826
C  5.640678 0.14932 -1.275778
C  5.651217 -0.006076 1.272864
C  0.357303 0.648459 0.037549
C  -0.964624 -0.001964 0.008577
C  -2.107833 0.754857 0.034666
C  -3.454545 0.251004 0.011298
C  -4.697882 0.88996 0.031169
C  -5.714217 -0.130342 -0.009954
C  -5.05361 -1.350404 -0.053532
H  5.73062 -1.662954 -0.107254
H  3.450761 -1.688425 0.790734
H  3.442918 -1.577951 -0.984906
H  2.908604 0.782136 0.952404
H  2.896913 0.892982 -0.833884
H  6.74104 0.253577 -1.308351
H  5.213895 1.169532 -1.245321
H  5.316455 -0.32695 -2.220152
H  5.226775 1.01093 1.370121
H  6.752021 0.092056 1.309581
H  5.332868 -0.592956 2.154928
H  -0.993037 -1.094074 -0.034143
H  -2.002302 1.846897 0.077085
H  -4.853259 1.966647 0.070747
H  -6.792072 0.016978 -0.007828
H  -5.381177 -2.385735 -0.093219
