program: Gaussian 09
title: 000098051
version: EM64L-G09RevD.01
frameworkgroup: C1[X(C11H13F3N2O)]
method: RPBEPBE
basis: SDD
operation: Freq
keyword: #p
keyword: freq=noraman
keyword: PBEPBE/SDD
title: #p freq=noraman PBEPBE/SDD
converged: YES YES NO NO
title: Mulliken charges:
elementType: F F F O N N C C C C C C C C C C C H H H H H H H H H H H H H
charge: -0.165482 -0.170214 -0.172311 -0.328150 -0.389942 -0.647876 -0.056148 -0.525141 0.530839 -0.700441 -0.508228 -0.402880 0.296406 -0.234739 -0.386925 0.244630 0.296982 0.255649 0.202253 0.232275 0.216523 0.196800 0.241060 0.257506 0.276069 0.290236 0.240943 0.265734 0.302854 0.341719
chargesum: 0.00000
title: Mulliken charges with hydrogens summed into heavy atoms:
elementType: F F F O N N C C C C C C C C C C C
charge: -0.165482 -0.170214 -0.172311 -0.328150 -0.113873 -0.003303 0.199501 -0.090613 0.530839 -0.046058 -0.250722 -0.112644 0.296406 0.006204 -0.121192 0.244630 0.296982
polarizability: 1.55966582e+02 -3.93831685e+00 1.40469292e+02 6.02682938e+00 1.03135909e+01 1.04534671e+02
1716.lowfreq: -16.9641 -8.5529 -5.4326 -0.0011 -0.0008 -0.0008 3.4088 11.7661 50.9207
frequency: -16.3671 10.0278 50.7656 59.2979 85.0059 102.1346 123.6982 162.2158 193.6317 207.2818 223.9676 257.6939 262.2492 277.2771 300.4769 333.2808 375.1086 416.4615 425.9299 448.9069 458.2608 471.1496 483.3777 524.0517 534.9310 582.6153 604.0943 614.8947 619.6701 699.5860 703.6126 713.6207 797.4207 832.4456 845.0428 888.9864 920.4210 929.9276 944.1986 978.9907 986.8878 1002.3283 1005.8599 1013.1394 1033.4442 1052.2347 1093.8679 1099.9799 1118.9602 1166.5922 1192.3921 1201.3580 1221.8763 1286.0406 1298.0374 1307.0448 1317.8088 1350.9894 1361.1376 1386.6864 1391.3440 1439.1594 1452.6408 1471.3465 1474.9072 1486.6347 1498.7119 1598.2113 1600.9254 1618.1437 1641.8159 2960.9001 2975.4446 3005.9721 3040.0203 3071.2479 3094.7239 3130.9286 3133.8210 3152.8855 3175.9646 3539.9062 3547.7284 3701.5501
redmass: 11.7858 6.1208 4.3784 7.9272 3.7195 5.2896 5.7301 4.4827 2.6399 3.2863 1.2542 1.5868 2.2326 2.7998 6.3544 7.5703 5.5326 3.4882 3.7453 3.4631 2.5360 2.1611 1.6908 4.8815 1.4455 5.3853 8.0729 5.8631 4.9773 2.9494 4.4598 8.3060 1.4991 3.3603 2.0102 1.4899 1.7885 1.9242 1.4793 7.5137 4.5761 1.5009 6.3152 2.7134 1.7488 3.1294 2.2244 2.4825 1.7934 2.3374 1.5292 1.2826 1.3762 1.7249 2.2354 1.7297 1.3423 1.4486 1.6615 1.6491 2.6847 2.1819 1.2186 1.1184 1.0605 2.4055 2.1791 1.5198 5.0431 5.7863 2.8421 1.0598 1.0377 1.0979 1.0869 1.0971 1.0997 1.0919 1.0902 1.0927 1.0972 1.0643 1.0579 1.1040
irintensity: 0.0905 3.1315 9.8113 12.3615 7.5529 3.8846 0.5616 1.6971 10.6463 1.2636 1.4317 1.3632 3.8812 2.0446 0.1866 7.6287 1.4642 10.5122 6.5078 44.6348 37.7119 125.1764 211.5237 2.1698 70.1861 0.9806 4.6282 8.1997 1.5240 20.6444 13.1295 22.8474 56.9312 30.3804 18.6348 7.2053 15.8848 6.4859 10.2825 195.1024 19.0102 1.2150 158.0124 16.0648 13.2262 113.1174 6.1924 16.5590 9.7380 81.0910 21.5550 37.8261 7.6053 132.9823 120.8683 81.7300 0.0204 4.2599 75.2300 17.1971 6.3718 19.1400 25.6984 70.9982 9.2203 13.4376 295.9527 71.8986 14.2208 7.7172 273.8453 20.4794 34.5649 13.1024 2.9824 41.2003 27.3687 3.2694 6.9264 5.1082 5.5539 27.0574 20.9862 37.1675
temp: 298.150 k
press: 1.00000 atm
elementType: 9 9 9 8 7 7 6 6 6 6 6 6 6 6 6 6 6 1 1 1 1 1 1 1 1 1 1 1 1 1
symmnumber: 1
zpe: 599115.6 jmol-1
zpe.correction: 0.228191 hartree
zpe.thermalcorrener: 0.244453 hartree
zpe.thermalcorrenthalpy: 0.245397 hartree
zpe.thermalcorrgfe: 0.182820 hartree
zpe.sumelectzpe: -909.991187 hartree
zpe.sumelectthermal: -909.974925 hartree
zpe.sumelectthermalent: -909.973980 hartree
zpe.sumelectthermalfe: -910.036558 hartree
dipole: -3.8794 0.9113 2.6239
dipole: 4.7712
quadrupole: -117.9174 -90.5525 -93.1644
quadrupole: -7.0736 -16.5856 -3.2806
quadrupole: -17.3726 9.9922 7.3804 -7.0736 -16.5856 -3.2806
hfenergy: -910.2193778 hartree
pointgroup: C01 [X(C11H13F3N2O1)]
dipole: -1.5842108 0.9482248 -0.3388837 debye
polarizability: 156.7810565|3.7213686|101.5481663|-1.6896384|3.7958521|142.6413217 unknown
InChI: InChI=1S/C11H13F3N2O/c1-7(16-10(15)17)5-8-3-2-4-9(6-8)11(12,13)14/h2-4,6-7,16H,5,15H2,1H3
charge 0 multiplicity 1
30 atoms
F  4.646311 -0.09128 -0.456396
F  3.761384 -1.200788 -2.227345
F  3.399166 1.018414 -1.993974
O  -3.07078 -0.024497 2.268323
N  -2.831457 0.632527 0.031233
N  -3.060897 2.244126 1.735654
C  -2.80323 -0.743732 -0.496899
C  -1.479675 -1.045823 -1.248724
C  -0.188076 -0.862628 -0.457022
C  -4.022522 -1.013255 -1.408165
C  1.013692 -0.59881 -1.1550
C  -0.131952 -0.995139 0.956863
C  2.24209 -0.481335 -0.462805
C  1.096748 -0.877831 1.642768
C  2.294363 -0.623405 0.941369
C  3.484684 -0.197741 -1.252909
C  -2.993392 0.89496 1.391095
H  -2.882708 -1.391164 0.394568
H  -1.437361 -0.425691 -2.168025
H  -1.537152 -2.096512 -1.601602
H  -4.026866 -2.061875 -1.75803
H  -4.009648 -0.359733 -2.302249
H  -4.960501 -0.828332 -0.857398
H  0.995045 -0.485831 -2.245769
H  -2.748121 1.401581 -0.635614
H  -1.047651 -1.165476 1.5338
H  1.117749 -0.979808 2.732647
H  3.247334 -0.531067 1.47008
H  -3.003876 3.007097 1.064971
H  -3.157504 2.458746 2.724455
