program: Gaussian 09
title: 000098018
version: EM64L-G09RevD.01
frameworkgroup: C1[X(C6H9NO2)]
method: RPBEPBE
basis: SDD
operation: Freq
keyword: #pfreq=noraman
keyword: PBEPBE/SDD
title: #p freq=noraman PBEPBE/SDD
converged: YES YES NO NO
title: Mulliken charges:
elementType: O O N C C C C C C H H H H H H H H H
charge: -0.254032 -0.217958 -0.004816 -0.214938 -0.672474 0.259597 -0.229636 -0.668768 -0.141660 0.277987 0.247516 0.235063 0.231121 0.231808 0.236271 0.215161 0.239028 0.230729
chargesum: 0.00000
title: Mulliken charges with hydrogens summed into heavy atoms:
elementType: O O N C C C C C C
charge: -0.254032 -0.217958 -0.004816 0.063049 0.041226 0.259597 0.238443 0.016150 -0.141660
polarizability: 8.47162378e+01 -7.29465020e-02 7.95264894e+01 7.61717564e-01 -1.55910698e+00 5.74799644e+01
1716.lowfreq: -5.6520 -0.0007 0.0003 0.0006 5.2199 8.4249 17.5084 53.2550 90.9285
frequency: 17.3154 53.1961 90.9146 134.5598 175.7108 178.4030 227.9420 261.3164 269.5821 332.7971 408.2054 438.9179 551.8809 592.2300 731.7856 798.6563 802.9470 821.1834 900.9669 1015.2295 1021.8390 1087.0687 1105.0730 1116.1724 1136.0241 1149.8366 1252.0638 1269.1871 1277.3020 1357.2080 1398.6680 1403.2671 1464.2056 1467.5456 1472.8362 1474.0332 1486.1029 1648.1287 2196.2345 2998.6697 3006.1395 3012.5920 3014.2235 3075.0068 3095.4856 3112.2957 3114.8069 3124.6322
redmass: 4.6091 3.2853 3.4213 2.7306 2.2443 1.3581 2.3309 1.5751 3.7155 4.1666 4.6349 7.5068 5.0403 5.0826 6.3013 1.4521 2.0242 3.5432 2.8487 2.0701 1.7641 3.5104 1.6901 2.2159 1.4635 3.3852 1.1363 1.5705 1.4589 1.3683 1.1847 1.2587 1.0394 1.0404 1.0603 1.0570 1.0654 10.2969 12.5375 1.0360 1.0812 1.0356 1.0581 1.1069 1.0985 1.1029 1.1014 1.1014
irintensity: 3.1629 0.5831 2.6383 2.5988 4.4950 1.5374 1.8949 2.5420 6.8877 6.9033 5.3609 0.6487 6.6257 4.1518 5.3375 6.2241 6.6768 5.3267 5.6811 10.7191 49.1494 111.9172 13.3995 1.6671 6.7364 267.4225 0.1707 48.1193 11.3999 2.1754 24.9890 19.2373 12.6355 13.8194 11.6817 3.5704 15.7308 205.8085 10.3584 16.5841 3.6799 13.7827 16.1251 6.4552 25.6812 37.2820 17.5293 13.1743
temp: 298.150 k
press: 1.00000 atm
elementType: 8 8 7 6 6 6 6 6 6 1 1 1 1 1 1 1 1 1
symmnumber: 1
zpe: 371682.1 jmol-1
zpe.correction: 0.141566 hartree
zpe.thermalcorrener: 0.152168 hartree
zpe.thermalcorrenthalpy: 0.153112 hartree
zpe.thermalcorrgfe: 0.103847 hartree
zpe.sumelectzpe: -438.521714 hartree
zpe.sumelectthermal: -438.511112 hartree
zpe.sumelectthermalent: -438.510168 hartree
zpe.sumelectthermalfe: -438.559433 hartree
dipole: 2.1188 -2.0183 2.2136
dipole: 3.6691
quadrupole: -44.7057 -66.0383 -53.0554
quadrupole: 6.3287 -4.3276 -0.6136
quadrupole: 9.8941 -11.4385 1.5444 6.3287 -4.3276 -0.6136
hfenergy: -438.6632799 hartree
pointgroup: C01 [X(C6H9N1O2)]
dipole: -1.0813199 0.8307768 -0.4736991 debye
dipolederiv: -1.4978392 -0.3008504 0.3470706 -0.3418517 -0.3703684 0.0077914 0.4080751 0.0325682 -0.6214693 -0.6280159 -0.1113183 -0.0702965 -0.0471319 -0.3207916 -0.2392576 0.2648384 -0.0288897 -0.9210216 -0.2348601 0.0080012 -0.0407375 0.0492245 -0.2082345 0.0462478 -0.0433821 -0.0143245 -0.266251 -0.0358392 -0.0802616 -0.086703 -0.0679666 0.1464298 0.0298295 -0.1572914 -0.0073869 -0.0049241 0.0002775 0.0431876 -0.0331354 -0.0019079 0.0478287 0.0287914 -0.0248305 -0.0004579 0.0381105 1.5317076 0.3282842 -0.1386285 0.2875342 0.2685436 0.3330616 -0.5578659 0.0998496 1.2779896 0.8535941 0.1443006 -0.0732108 0.2382853 0.4036147 -0.0668871 0.0464865 -0.0233095 0.2526202 -0.0872129 -0.0278906 0.078269 -0.0425152 0.048958 0.017481 0.071767 0.0180818 -0.0261151 -0.0361763 -0.0902997 0.1071934 -0.1651531 -0.0141319 -0.1517972 0.1267862 -0.062616 0.0782652 0.053096 0.049027 0.023204 0.0591967 0.0315019 -0.015083 0.0259854 -0.0310568 0.0265536 0.0886638 0.02756 0.0306886 0.0655107 -0.0350515 -0.0773627 0.0593235 -0.0380035 0.0602281 0.0597823 0.0646595 -0.0418734 0.0563742 0.0201547 0.0943118 -0.0249445 0.1141484 -0.0199285 -0.0530568 -0.0922433 -0.0491217 -0.0919256 0.0594653 -0.0359853 -0.076622 -0.0635107 0.0461554 -0.0438272 -0.0186987 -0.007612 -0.0120835 -0.0020743 0.1068192 -0.0856179 0.0666748 -0.0548334 -0.049581 0.0552432 0.0511126 -0.0144988 -0.0840372 -0.0508525 -0.0113853 -0.0655941 0.0488705 -0.096745 -0.1005868 -0.0338299 -0.1088033 0.0613096 -0.0333359 -0.0474632 -0.0421162 0.0653143 0.0739151 0.0649845 -0.0819693 0.0594148 0.0491485 0.0822895 -0.0245623 0.0884962 -0.0409448 0.1021174 0.0369017 0.0195798 0.0782971 -0.1022656 -0.0760621 0.050703 -0.0425533 0.0613806 unknown
polarizability: 83.8210366|4.655568|61.0128127|1.2390364|-7.2263358|76.8888423 unknown
InChI: InChI=1S/C6H9NO2/c1-3-9-6(8)5(2)4-7/h5H,3H2,1-2H3
charge 0 multiplicity 1
18 atoms
O  -1.469542 0.323002 0.245781
O  -0.441634 0.041623 -1.829532
N  1.763697 -0.426784 1.981717
C  0.784683 1.1298 0.044035
C  1.882797 1.506147 -0.980067
C  -0.415462 0.433554 -0.644817
C  -2.700593 -0.377162 -0.255333
C  -3.676454 -0.435532 0.91344
C  1.313101 0.265888 1.121311
H  0.384638 2.041862 0.529628
H  2.260178 0.607188 -1.492315
H  1.463421 2.182063 -1.74363
H  2.721531 2.011216 -0.473144
H  -3.092813 0.197074 -1.113941
H  -2.400162 -1.378286 -0.612649
H  -4.6027 -0.949417 0.598205
H  -3.241876 -0.991138 1.761329
H  -3.942411 0.577803 1.259079
