program: Gaussian 09
title: 000098032
version: EM64L-G09RevD.01
frameworkgroup: C1[X(C16H14O2)]
method: RPBEPBE
basis: SDD
operation: Freq
keyword: #pfreq=noraman
keyword: PBEPBE/SDD
title: #p freq=noraman PBEPBE/SDD
converged: YES YES NO NO
title: Mulliken charges:
elementType: O O C C C C C C C C C C C C C C C C H H H H H H H H H H H H H H
charge: -0.263583 -0.247404 0.321379 -0.481252 0.331030 0.468855 -0.363439 0.096145 -0.361228 -0.267986 -0.236674 -0.305665 -0.373768 -0.384356 -0.237715 -0.238399 -0.234170 -0.537068 0.300634 0.218619 0.244402 0.268604 0.224750 0.208526 0.226580 0.239336 0.229183 0.231900 0.233091 0.220768 0.220434 0.248473
chargesum: 0.00000
title: Mulliken charges with hydrogens summed into heavy atoms:
elementType: O O C C C C C C C C C C C C C C C C
charge: -0.263583 -0.247404 0.321379 -0.180618 0.331030 0.468855 -0.144820 0.096145 -0.116826 0.000618 -0.011925 -0.097139 -0.147188 -0.145020 -0.008532 -0.006500 -0.001080 0.152607
polarizability: 3.82326227e+02 8.27328976e-01 1.80015839e+02 -3.32210354e-01 5.29638970e-01 7.43102795e+01
1716.lowfreq: -5.6393 -0.0012 -0.0011 -0.0010 3.6428 4.8821 12.2164 27.2117 49.9370
frequency: 9.6745 27.1716 49.9188 79.6927 91.0444 113.4245 146.9484 182.1571 201.2704 205.0402 241.8008 262.5038 275.9992 289.0732 402.5907 416.6598 433.3347 434.7708 489.5845 526.7416 545.3051 548.5935 562.8947 615.0960 654.3414 679.7369 691.7684 714.8267 744.4589 772.7142 797.2159 829.9117 847.2204 877.5240 884.2454 892.6204 927.4968 942.7274 968.1717 979.9734 980.0870 987.9034 997.5488 997.8038 1017.8457 1024.8455 1053.5205 1083.1146 1098.7517 1111.8473 1149.7983 1171.7056 1174.3091 1189.2001 1193.4010 1220.7783 1246.3397 1281.4401 1305.0700 1327.1942 1336.2652 1386.6092 1396.6870 1427.6775 1438.9540 1443.1390 1467.8679 1472.8508 1473.8201 1484.8868 1521.4353 1579.8054 1581.7650 1609.8231 1615.4165 1637.2443 2958.0485 3045.7116 3095.6457 3125.4442 3126.9035 3129.0597 3134.6042 3141.2573 3150.4098 3153.1494 3163.8494 3167.5652 3169.4813 3174.9230
redmass: 4.7544 4.3720 5.0784 3.3467 6.0474 3.0935 5.0919 2.6584 4.1104 2.6034 4.2123 1.6725 3.0535 5.0194 2.7554 6.9687 4.0524 3.7378 2.8589 5.0383 4.9595 4.5527 6.7622 6.4318 7.1540 2.4929 1.8304 1.9032 6.9891 1.7513 1.9671 5.3607 1.2811 1.5145 1.7638 4.2692 1.4414 1.5290 1.3437 2.0530 2.4678 6.1770 4.9029 1.4086 1.2359 2.2136 1.9753 1.6101 1.7442 1.2596 1.5349 1.6819 1.0717 1.1672 1.2096 1.7108 3.0111 1.3892 2.0995 1.6918 1.3008 6.9572 8.6611 1.7962 2.0193 1.8069 1.0515 1.2959 1.7179 2.3154 9.3008 5.7590 5.8447 5.9564 6.7013 5.6327 1.0332 1.1039 1.0892 1.0855 1.0990 1.0874 1.0869 1.0918 1.0934 1.0940 1.0908 1.1016 1.0917 1.0959
irintensity: 0.2118 1.8221 0.6977 3.4963 0.1437 2.1477 1.4471 0.1276 0.5956 1.3650 0.4753 0.4378 1.6742 13.5145 0.0218 0.1940 2.0185 2.0648 15.2607 5.7926 2.2906 0.8299 43.2902 0.1496 1.5557 4.1579 68.9130 0.3799 47.6346 115.5547 4.1514 11.3858 0.3801 6.6341 15.1702 2.0289 0.0008 13.8995 0.4311 3.6258 5.0353 16.2266 130.7310 14.1837 40.3817 8.8547 6.5012 5.1421 9.9257 0.2408 10.7795 27.0643 1.0342 9.8739 12.9065 59.4473 392.4753 15.9166 128.4045 97.8985 62.4921 27.5849 10.5626 64.0078 17.9317 76.3780 13.8687 7.1269 35.4558 28.2580 298.7188 5.9562 32.5587 3.2186 6.7970 312.6529 77.3233 49.8111 0.8562 4.9943 26.0727 0.3879 9.1145 8.5577 7.1156 32.5915 21.4547 35.3902 3.5892 21.2069
temp: 298.150 k
press: 1.00000 atm
elementType: 8 8 6 6 6 6 6 6 6 6 6 6 6 6 6 6 6 6 1 1 1 1 1 1 1 1 1 1 1 1 1 1
symmnumber: 1
zpe: 661409.6 jmol-1
zpe.correction: 0.251918 hartree
zpe.thermalcorrener: 0.267927 hartree
zpe.thermalcorrenthalpy: 0.268871 hartree
zpe.thermalcorrgfe: 0.205671 hartree
zpe.sumelectzpe: -767.262398 hartree
zpe.sumelectthermal: -767.246388 hartree
zpe.sumelectthermalent: -767.245444 hartree
zpe.sumelectthermalfe: -767.308645 hartree
dipole: -0.0721 4.2695 0.0663
dipole: 4.2706
quadrupole: -61.6674 -101.6973 -112.0337
quadrupole: -8.3286 -0.1314 0.0641
quadrupole: 30.1321 -9.8979 -20.2342 -8.3286 -0.1314 0.0641
hfenergy: -767.5143152 hartree
pointgroup: C01 [X(C16H14O2)]
dipole: 0.025279 1.6680147 0.2003638 debye
polarizability: 382.2786096|0.0348806|178.2325687|-3.9615582|13.6118065|76.1411663 unknown
InChI: InChI=1S/C16H14O2/c1-18-15-9-5-8-14(12-15)16(17)11-10-13-6-3-2-4-7-13/h2-12H,1H3
charge 0 multiplicity 1
32 atoms
O  5.337074 -0.830682 -0.374412
O  0.524343 -2.051629 -0.298537
C  1.753797 0.01058 -0.061784
C  2.965622 -0.695526 -0.245587
C  4.206761 -0.026101 -0.171395
C  -3.37402 -0.254118 -0.081768
C  1.796506 1.410016 0.204279
C  0.474233 -0.784484 -0.152729
C  4.251458 1.367673 0.093495
C  -2.005305 -0.780728 -0.131554
C  3.038558 2.069893 0.280999
C  -0.830653 -0.076109 -0.077384
C  -3.677374 1.135802 0.029766
C  -4.459021 -1.176613 -0.149075
C  -5.012404 1.579764 0.071874
C  -5.796533 -0.732532 -0.106801
C  -6.079081 0.648694 0.003907
C  6.651557 -0.188152 -0.304741
H  2.931124 -1.770782 -0.444586
H  0.88034 1.985047 0.362647
H  5.202954 1.904104 0.156022
H  -1.900347 -1.872414 -0.224593
H  3.071363 3.144845 0.490375
H  -0.833906 1.014327 0.011004
H  -2.865222 1.869171 0.082684
H  -4.240552 -2.247951 -0.235375
H  -5.22858 2.650474 0.15745
H  -6.615538 -1.457948 -0.160052
H  -7.11683 0.998397 0.036761
H  6.83408 0.250489 0.695853
H  6.759598 0.595662 -1.079911
H  7.374099 -0.99567 -0.492033
