program: Gaussian 09
title: 000098031
version: EM64L-G09RevD.01
frameworkgroup: C1[X(C17H20N2)]
method: RPBEPBE
basis: SDD
operation: Freq
keyword: #pfreq=noraman
keyword: PBEPBE/SDD
title: #p freq=noraman PBEPBE/SDD
converged: YES YES NO NO
title: Mulliken charges:
elementType: N N C C C C C C C C C C C C C C C C C H H H H H H H H H H H H H H H H H H H H
charge: -0.161084 -0.288321 -0.150376 -0.495949 -0.327957 -0.429404 -0.494032 0.446103 0.455002 -0.373232 -0.457012 -0.454704 -0.371588 -0.241197 -0.224718 -0.245563 -0.220573 -0.232045 -0.247262 0.215333 0.232567 0.204008 0.193482 0.226244 0.190607 0.208812 0.197794 0.251926 0.269156 0.255045 0.236551 0.231331 0.254299 0.224652 0.224001 0.226922 0.223096 0.222365 0.225723
chargesum: 0.00000
title: Mulliken charges with hydrogens summed into heavy atoms:
elementType: N N C C C C C C C C C C C C C C C C C
charge: -0.161084 -0.019165 0.064958 -0.059374 0.091769 -0.029985 -0.044313 0.446103 0.455002 -0.118186 -0.220461 -0.223373 -0.117289 -0.016545 -0.000717 -0.018641 0.002522 -0.009680 -0.021539
polarizability: 2.22139563e+02 8.72031397e+00 1.74963131e+02 1.19836424e+01 -6.39741693e+00 1.70040934e+02
1716.lowfreq: -6.1245 -0.0006 -0.0004 0.0006 1.5121 15.6567 27.9523 36.2303 41.9972
frequency: 27.9395 36.1059 41.9298 65.8848 85.4850 99.7032 159.4562 191.9078 223.3109 244.6534 268.5557 309.9394 333.3402 357.8431 386.9294 406.7146 407.4732 438.8275 469.7783 490.6538 531.1266 550.5612 603.1798 616.9198 617.5648 622.9653 685.5734 705.1000 709.0726 739.1378 767.2343 785.4869 808.0048 826.9049 858.4472 860.6825 894.7351 902.2864 917.5784 926.5382 975.0905 981.4420 982.6161 989.4985 990.6872 995.5362 997.5893 1010.0522 1023.0863 1025.8640 1039.1551 1063.7895 1076.6346 1077.8402 1095.0782 1110.4947 1134.3596 1168.9443 1170.0281 1170.9823 1179.0720 1181.1247 1196.5112 1210.0373 1219.4168 1244.0130 1253.8320 1264.9630 1289.2933 1309.9659 1315.8262 1323.7455 1343.6817 1358.8430 1371.0263 1384.3886 1385.6265 1393.6795 1439.2800 1440.3625 1441.4388 1454.5014 1461.8191 1465.8777 1469.4307 1481.3539 1482.4811 1592.5281 1593.3429 1613.2349 1614.5452 2850.0610 2857.5666 2869.9831 2875.5817 2885.3286 3014.4267 3041.2614 3046.9674 3049.0021 3111.5548 3113.6441 3121.0578 3123.0130 3134.3911 3135.7080 3145.7496 3146.7048 3160.2070 3161.7807 3463.8005
redmass: 4.0173 4.4530 3.8663 3.6362 3.9250 3.4674 3.6183 4.4378 4.3792 2.3885 4.1665 3.0049 2.8372 2.4460 2.3804 2.8438 2.8639 3.0372 2.8956 2.7353 3.3090 2.4217 4.3473 5.7319 5.4251 4.2119 2.0394 2.1357 1.8016 1.6096 1.8586 2.9777 3.5736 2.6906 1.2488 1.2467 2.0618 2.4731 1.4078 1.4870 2.0969 1.3947 1.3938 5.1816 5.6966 1.4855 1.3381 1.9025 2.3054 2.1459 2.3050 1.9830 1.6459 1.7023 1.9724 2.6375 2.8482 1.0636 3.6779 1.0578 1.1104 1.1110 1.3519 2.4390 1.5301 1.3090 1.4634 1.4151 1.2996 1.3313 1.2829 1.2273 1.4244 1.5271 1.8908 1.6591 4.5288 2.4752 1.8156 1.5127 2.0673 1.0801 1.1121 1.1343 1.1232 2.3353 2.1143 6.1372 6.1407 6.2181 6.1301 1.0763 1.0731 1.0704 1.0726 1.0692 1.0852 1.0905 1.0903 1.0889 1.0866 1.0869 1.0862 1.0861 1.0916 1.0913 1.0953 1.0954 1.1013 1.1013 1.0754
irintensity: 0.0903 0.0084 0.0403 0.2895 0.3582 0.1712 2.7253 1.8757 0.1551 2.6107 0.5669 2.1323 3.3827 1.6878 1.7536 0.1761 0.4048 25.9877 28.8883 20.9020 11.1693 28.4879 5.4381 6.5526 9.9565 19.4323 60.7570 23.0656 61.2232 47.7913 61.6384 21.9274 2.5546 0.9067 0.1606 0.0249 4.5727 8.2822 1.8710 5.0020 6.6589 0.4410 0.3600 0.0707 0.1325 4.3196 1.4870 6.0205 17.9103 8.8472 13.1635 24.6104 7.9234 5.0176 1.9220 40.8754 23.6960 0.7522 37.7015 0.3722 1.9674 0.8004 0.5696 2.8225 4.4835 7.4041 4.5428 2.9697 10.9590 15.9177 7.9503 27.9291 3.9323 3.0967 2.1529 1.4925 4.2529 4.4746 5.0256 2.5598 14.5766 1.2338 4.7468 13.3799 3.0323 14.2988 16.9297 0.6717 1.5080 4.8895 9.8725 33.3874 58.6260 39.7167 47.9361 214.9032 10.0700 42.3420 55.3192 17.7288 7.8433 6.9472 0.0681 0.0781 18.6755 22.3585 31.4054 41.1604 28.9039 24.3813 1.3146
temp: 298.150 k
press: 1.00000 atm
elementType: 7 7 6 6 6 6 6 6 6 6 6 6 6 6 6 6 6 6 6 1 1 1 1 1 1 1 1 1 1 1 1 1 1 1 1 1 1 1 1
symmnumber: 1
zpe: 868114.0 jmol-1
zpe.correction: 0.330647 hartree
zpe.thermalcorrener: 0.346865 hartree
zpe.thermalcorrenthalpy: 0.347809 hartree
zpe.thermalcorrgfe: 0.285415 hartree
zpe.sumelectzpe: -767.904682 hartree
zpe.sumelectthermal: -767.888464 hartree
zpe.sumelectthermalent: -767.887520 hartree
zpe.sumelectthermalfe: -767.949915 hartree
dipole: -0.4694 0.6794 0.3071
dipole: 0.8811
quadrupole: -107.6089 -109.6805 -106.2252
quadrupole: 0.7457 0.7070 2.5663
quadrupole: 0.2293 -1.8423 1.6130 0.7457 0.7070 2.5663
hfenergy: -768.2353294 hartree
pointgroup: C01 [X(C17H20N2)]
dipole: -0.1680993 -0.2525514 -0.1676833 debye
polarizability: 222.8767834|-3.4369191|176.4342003|-12.7926342|-5.9727303|167.8326447 unknown
InChI: InChI=1S/C17H20N2/c1-3-7-15(8-4-1)14-19-12-11-18-13-17(19)16-9-5-2-6-10-16/h1-10,17-18H,11-14H2
charge 0 multiplicity 1
39 atoms
N  0.130288 -0.989349 0.005142
N  -1.132264 -3.44541 -0.803172
C  -1.326159 -1.213281 0.266264
C  -1.889837 -2.182276 -0.81118
C  0.878043 -2.277617 -0.046639
C  0.294243 -3.217835 -1.110719
C  0.750902 -0.056641 0.981558
C  -2.132148 0.08191 0.23665
C  2.114505 0.461012 0.533316
C  -1.9598 1.024003 -0.810776
C  -3.126735 0.325366 1.215665
C  3.137244 0.703739 1.483192
C  2.366408 0.756793 -0.830608
C  -2.762581 2.18369 -0.873449
C  -3.935877 1.48289 1.153342
C  -3.756564 2.416424 0.106795
C  4.382962 1.240622 1.084089
C  3.61132 1.287555 -1.233892
C  4.624654 1.534958 -0.277482
H  -1.472364 -1.710182 1.2593
H  -2.951408 -2.385429 -0.583443
H  -1.841718 -1.651394 -1.794317
H  0.842281 -2.796687 0.943682
H  1.934045 -2.054849 -0.280474
H  0.45086 -2.755948 -2.116958
H  0.834051 -4.181925 -1.083326
H  0.850832 -0.526052 1.993178
H  0.065203 0.803458 1.100856
H  -1.564863 -4.177776 -1.37893
H  -1.177811 0.845078 -1.557512
H  -3.265691 -0.394931 2.031841
H  2.958126 0.470448 2.540666
H  1.577775 0.54907 -1.562408
H  -2.614909 2.906359 -1.684322
H  -4.699422 1.658199 1.919849
H  -4.37992 3.316464 0.057672
H  5.1637 1.422901 1.831608
H  3.793009 1.509435 -2.292108
H  5.590921 1.947208 -0.589849
