program: Gaussian 09
title: 000097999
version: EM64L-G09RevD.01
frameworkgroup: C1[X(C8H14O3)]
method: RPBEPBE
basis: SDD
operation: Freq
keyword: #pfreq=noraman
keyword: PBEPBE/SDD
title: #p freq=noraman PBEPBE/SDD
converged: YES YES NO NO
title: Mulliken charges:
elementType: O O O C C C C C C C C H H H H H H H H H H H H H H
charge: -0.461009 -0.261919 -0.264498 -0.163052 -0.091816 -0.444205 -0.430327 -0.396261 -0.396156 0.200477 -0.501780 0.259427 0.191973 0.237425 0.201433 0.222780 0.208439 0.196520 0.205121 0.196964 0.205926 0.360511 0.243639 0.235546 0.244843
chargesum: 0.00000
title: Mulliken charges with hydrogens summed into heavy atoms:
elementType: O O O C C C C C C C C
charge: -0.100497 -0.261919 -0.264498 0.096375 0.100157 -0.005348 0.000891 0.005379 0.006733 0.200477 0.222248
polarizability: 1.12295164e+02 8.28457692e-01 9.40467618e+01 -5.13716220e-01 1.67762818e+00 7.22578297e+01
1716.lowfreq: -20.5784 -0.0003 0.0006 0.0008 3.8677 14.6026 40.3408 88.7605 101.2855
frequency: 40.2163 88.7535 101.2822 131.4544 150.4294 188.8564 262.8910 281.5389 307.3739 317.5678 373.9432 415.9009 430.5648 474.1531 535.4432 580.2573 611.5738 721.9003 783.9641 815.4329 842.2498 878.3628 884.5318 926.5218 946.4305 990.5072 1033.5255 1048.4823 1060.5158 1101.8947 1112.2306 1112.4214 1117.3085 1148.9593 1162.3558 1206.7960 1223.0824 1239.3400 1270.8488 1283.0142 1294.7342 1323.0098 1324.0375 1339.6951 1341.8005 1354.4439 1394.2553 1421.8479 1452.6751 1462.8282 1463.0691 1465.5344 1471.3110 1476.6458 1605.8554 2927.8276 2970.8620 2971.2162 2973.4702 2984.4265 2990.4909 3007.8075 3035.6436 3041.5992 3060.8173 3067.8295 3111.7101 3152.2401 3479.3965
redmass: 4.8827 2.1086 1.3485 3.3441 3.6353 2.5337 6.2316 3.7156 2.3289 2.3504 4.4662 3.8147 3.4378 2.7169 2.2733 1.1149 3.7950 5.1605 1.8330 3.1501 1.9445 1.8078 2.1874 2.7499 2.3003 4.1637 2.8302 1.5720 1.7182 1.5649 1.4571 1.9890 2.1256 1.4869 2.5670 1.4298 1.3789 1.4193 1.2776 1.2419 1.4701 1.3525 1.3002 1.4466 1.4142 1.3810 1.6792 1.1929 1.0502 1.0733 1.0650 1.0889 1.0819 1.0941 8.7391 1.0826 1.0689 1.0675 1.0672 1.0694 1.0635 1.0293 1.0957 1.0999 1.1012 1.0979 1.1048 1.1052 1.0648
irintensity: 1.2269 1.0874 0.6530 1.9784 0.9968 5.1772 5.7096 4.3507 9.5577 11.2048 6.0338 4.4972 3.1875 2.6728 5.2196 201.6978 16.2754 3.6487 4.6717 6.6166 15.8373 5.8260 3.3346 4.9354 5.5033 43.4743 75.3689 9.3169 1.2915 22.0676 0.2928 4.7300 4.7769 37.2238 242.4006 12.6868 2.5209 17.6415 31.3503 5.7258 32.6263 26.9178 3.0089 0.6067 2.4148 12.0493 28.0255 20.1773 14.1818 15.2872 1.6087 11.3013 23.1503 2.1156 163.0002 35.8868 18.9077 34.2267 19.1300 25.3308 33.7851 31.9963 56.3685 63.9374 43.2785 36.8149 24.2010 14.4793 44.3482
temp: 298.150 k
press: 1.00000 atm
elementType: 8 8 8 6 6 6 6 6 6 6 6 1 1 1 1 1 1 1 1 1 1 1 1 1 1
symmnumber: 1
zpe: 557280.1 jmol-1
zpe.correction: 0.212257 hartree
zpe.thermalcorrener: 0.223717 hartree
zpe.thermalcorrenthalpy: 0.224661 hartree
zpe.thermalcorrgfe: 0.174695 hartree
zpe.sumelectzpe: -538.039032 hartree
zpe.sumelectthermal: -538.027572 hartree
zpe.sumelectthermalent: -538.026628 hartree
zpe.sumelectthermalfe: -538.076594 hartree
dipole: -1.2805 -3.2369 0.3883
dipole: 3.5026
quadrupole: -56.2512 -74.3225 -66.2868
quadrupole: -0.1609 1.7027 0.5804
quadrupole: 9.3690 -8.7023 -0.6667 -0.1609 1.7027 0.5804
hfenergy: -538.2512891 hartree
pointgroup: C01 [X(C8H14O3)]
dipole: -0.5202448 1.2686062 -0.1375841 debye
dipolederiv: -0.479489 -0.0551233 0.1704323 -0.0708383 -0.8890758 0.011833 0.151518 0.0484417 -0.4557496 -1.253694 0.3549301 0.0799731 0.5237209 -0.7105363 -0.1329024 0.1310675 -0.1482048 -0.3240631 -0.7032981 -0.1916454 -0.0837095 0.2190755 -0.9095435 -0.1909565 -0.0287264 -0.2772489 -0.3874169 -0.2971696 -0.0169042 -0.0289655 -0.1159233 -0.2005219 -0.0354934 -0.1001044 -0.0641282 0.0816138 0.3710841 0.0599748 -0.0844674 -0.0014744 0.6144389 -0.0592162 -0.1055212 0.0043306 0.3716613 -0.0094082 0.0445876 -0.0210064 0.1288469 0.0884808 0.0084305 -0.0300359 -0.0466364 0.1518771 -0.0210237 -0.0715572 -0.0044871 0.0128998 0.015855 0.0150021 0.021583 -0.0145101 0.1280635 0.0581245 0.0198717 0.0024922 -0.0335649 0.0550487 -0.0172446 0.0333741 0.0240863 0.1551541 0.0807925 0.0046511 0.0204642 0.0212433 0.0513356 0.0016677 -0.021791 -0.0141878 0.1542407 1.3784804 -0.0708998 0.0437757 -0.609197 1.20346 0.3690918 -0.030835 0.4598118 0.3328233 0.6460827 -0.0966213 -0.0130569 -0.0216495 0.2284785 -0.0163365 0.0293413 -0.0230319 0.2604869 0.0475845 0.0066813 -0.0268125 0.0129269 0.079602 0.0017649 0.0242978 0.0014216 -0.0826986 0.0083903 0.0036631 -0.0296656 0.0057296 -0.0290785 0.0488845 0.0063058 0.0408424 -0.2193495 -0.0083729 0.1012808 0.0375792 0.0993004 -0.0576396 -0.0319877 0.0466127 -0.0512836 0.0589219 0.0518618 -0.0317833 -0.0168832 -0.0416046 0.0512803 -0.0294225 -0.0349613 0.0325007 -0.1652905 -0.0459862 0.0973133 0.0424066 0.1182269 -0.0712584 -0.0469705 0.0559436 -0.0685864 0.0569495 0.0605418 -0.0252097 0.0140606 -0.0256279 0.0665552 -0.0070189 -0.0359456 0.0297624 -0.1596574 0.0210351 0.0144868 -0.001163 0.0235581 0.0764325 0.0113076 -0.0279755 -0.0557585 -0.1873259 -0.0042784 -0.0709636 0.0189575 -0.0821565 -0.1825706 0.0600414 0.026847 0.0917699 0.0551464 0.0870238 0.0160858 -0.0331022 0.012696 0.0205185 -0.0050694 0.0433019 0.013352 -0.196174 -0.2183294 -0.0511391 -0.041101 -0.0499284 0.0355277 -0.0079728 -0.0776671 -0.0150101 0.0673169 0.2584832 -0.1289748 -0.0870788 -0.0942793 0.4170228 0.0407982 -0.0582689 0.0103634 0.277391 -0.0128968 0.0223207 0.0110736 -0.042009 0.1047021 -0.0360496 -0.0751233 -0.0060188 -0.102258 0.0134578 0.059667 0.0159101 0.1131256 -0.0453078 -0.0570433 0.0339119 -0.0599777 0.099053 -0.0289962 0.0053076 0.014374 -0.1030967 -0.0132061 0.1048625 0.022851 0.0879005 0.0292841 unknown
polarizability: 112.3180141|-0.5973804|94.0037432|0.0426151|1.8512353|72.2779979 unknown
InChI: InChI=1S/C8H14O3/c1-11-8(10)6-4-2-3-5-7(6)9/h6-7,9H,2-5H2,1H3
charge 0 multiplicity 1
25 atoms
O  0.617537 -2.32467 0.328885
O  -2.295698 0.831555 0.321758
O  -1.872125 -1.293568 -0.501713
C  0.01208 0.10413 0.313228
C  0.952213 -1.010583 -0.226117
C  0.446869 1.502788 -0.213603
C  2.411508 -0.716631 0.15471
C  1.918278 1.789901 0.163965
C  2.861484 0.674849 -0.347238
C  -1.443175 -0.215602 -0.009509
C  -3.741995 0.597171 0.076543
H  0.094632 0.108796 1.421344
H  0.855239 -1.025788 -1.336521
H  -0.225287 2.276513 0.196082
H  0.336339 1.526217 -1.317104
H  3.050926 -1.515463 -0.262976
H  2.500554 -0.774962 1.2578
H  2.003653 1.865039 1.267644
H  2.223351 2.770041 -0.249908
H  2.86826 0.684027 -1.456914
H  3.90022 0.872862 -0.021448
H  -0.30032 -2.542776 0.009353
H  -3.919645 0.406449 -0.994763
H  -4.233226 1.523818 0.403867
H  -4.090774 -0.269611 0.662134
