program: Gaussian 09
title: 000097988
version: EM64L-G09RevD.01
frameworkgroup: C1[X(C4H9ClO2)]
method: RPBEPBE
basis: SDD
operation: Freq
keyword: #p
keyword: freq=noraman
keyword: PBEPBE/SDD
title: #p freq=noraman PBEPBE/SDD
converged: YES YES NO NO
title: Mulliken charges:
elementType: Cl O O C C C C H H H H H H H H H
charge: -0.092437 -0.293922 -0.433789 -0.082885 -0.259724 -0.589983 -0.489607 0.248899 0.198114 0.223853 0.296713 0.285900 0.339751 0.208392 0.234034 0.206690
chargesum: 0.00000
title: Mulliken charges with hydrogens summed into heavy atoms:
elementType: Cl O O C C C C
charge: -0.092437 -0.293922 -0.094037 0.166014 0.162243 -0.007370 0.159510
polarizability: 6.50965900e+01 1.27314990e+00 5.76027564e+01 4.71171723e+00 3.02583554e+00 5.39970983e+01
1716.lowfreq: -16.1794 0.0028 0.0037 0.0038 7.7366 13.7690 52.7728 87.2322 146.7834
frequency: 52.6352 87.2234 146.7522 176.3295 195.2481 231.7351 319.0262 395.8543 415.4829 444.4294 514.8940 663.8549 832.3939 887.9952 897.6816 986.4930 1047.1574 1061.2477 1098.4791 1116.7386 1152.9957 1170.5938 1208.2868 1226.8859 1281.7749 1321.1306 1360.8758 1381.1564 1421.3652 1439.3730 1459.2171 1467.5307 1482.7393 2932.8786 2943.4936 3003.1743 3011.0991 3036.9373 3075.1453 3107.2372 3168.0217 3501.1480
redmass: 4.6046 2.7260 2.4616 3.2906 3.5889 1.4575 2.7975 2.4960 1.4027 2.8978 3.9860 3.7554 2.8512 2.2319 3.6441 1.9892 1.5695 4.8646 1.7978 1.2778 1.3387 1.1899 1.5692 1.3531 1.2687 1.2972 1.2568 1.3875 1.1086 1.1478 1.0509 1.0631 1.0686 1.0363 1.0536 1.1029 1.1034 1.0857 1.0570 1.0981 1.1123 1.0653
irintensity: 0.5031 10.5094 6.7642 3.1775 3.1774 7.9433 1.6203 5.1902 148.4243 8.6668 30.4225 15.7076 21.2368 5.4435 15.0371 55.9218 10.5538 83.1221 88.5785 1.8628 2.2112 5.6849 21.1922 7.2721 18.4511 7.8953 16.5670 14.5025 22.2177 0.4704 12.8606 15.0215 8.0537 62.9566 59.3982 57.8686 50.4905 15.6281 15.4259 29.1555 3.4191 11.1962
temp: 298.150 k
press: 1.00000 atm
elementType: 17 8 8 6 6 6 6 1 1 1 1 1 1 1 1 1
symmnumber: 1
zpe: 339289.1 jmol-1
zpe.correction: 0.129228 hartree
zpe.thermalcorrener: 0.138060 hartree
zpe.thermalcorrenthalpy: 0.139004 hartree
zpe.thermalcorrgfe: 0.094809 hartree
zpe.sumelectzpe: -767.708566 hartree
zpe.sumelectthermal: -767.699734 hartree
zpe.sumelectthermalent: -767.698790 hartree
zpe.sumelectthermalfe: -767.742985 hartree
dipole: 1.8793 -0.6418 -0.1608
dipole: 1.9924
quadrupole: -46.5957 -56.5651 -46.6392
quadrupole: -1.1288 -3.1891 0.5290
quadrupole: 3.3376 -6.6317 3.2941 -1.1288 -3.1891 0.5290
hfenergy: -767.8377942 hartree
pointgroup: C01 [X(C4H9Cl1O2)]
dipole: -0.7743357 -0.1163814 0.0359147 debye
dipolederiv: -0.2637589 0.1038618 -0.0682492 0.1217628 -0.4112884 0.0934738 -0.121978 0.1728853 -0.3709299 -1.0509068 -0.1575225 -0.0001175 -0.194484 -0.4893838 0.0090452 -0.032046 -0.009934 -0.4138942 -0.7652207 -0.1163874 0.016114 -0.1085702 -0.4447031 -0.2242717 0.0164571 -0.2629616 -0.4357129 0.5247045 0.1186819 0.0304381 0.1162318 0.2668635 0.1081912 -0.0052664 0.234865 0.2725434 0.4411866 0.0452586 0.1710921 0.1360741 0.4066779 -0.0121484 0.3211114 0.0502008 0.2652243 0.1474465 -0.1070743 0.1334343 -0.2021071 0.2902496 -0.3116623 0.1614407 -0.3257884 0.3981678 0.6816368 0.041821 -0.0781802 0.0271854 0.3435402 -0.0551714 -0.2236402 -0.0880082 0.2893613 0.0580021 0.0083076 -0.0419795 0.0410157 -0.0076324 0.0957117 -0.0065046 0.0087799 -0.0460363 0.0115855 -0.0244234 -0.0534364 -0.0289544 -0.004673 0.1218898 -0.0835703 0.0474359 -0.1206553 -0.0361317 0.0971806 0.0235792 0.0309523 -0.1504673 -0.0838186 -0.0291987 -0.0699548 0.0315995 0.0975739 -0.0570746 -0.0916133 -0.0528039 0.0028693 0.0127025 -0.0860657 0.0082053 0.0184107 -0.0567296 0.0427526 0.0666431 0.0297544 0.0518668 0.0752004 0.0439443 0.0607801 -0.0296788 0.3332154 0.0031462 -0.0409007 0.0386893 0.2550972 0.1770392 -0.0593768 0.1336443 0.2094069 -0.0074742 0.0263389 -0.0417462 -0.0132367 -0.0184159 0.126674 0.0861825 0.1603158 -0.1172806 -0.0475125 -0.0736852 -0.0646353 -0.0972715 0.0548503 -0.0698305 -0.0995555 -0.0793044 -0.0035649 -0.0676169 0.0488182 0.0395574 0.155762 -0.1454509 -0.0630249 0.1180662 -0.0411609 0.0530388 unknown
polarizability: 63.955285|-1.6731059|57.2373632|4.9020213|-4.2755174|55.5037965 unknown
InChI: InChI=1S/C4H9ClO2/c1-7-3-4(6)2-5/h4,6H,2-3H2,1H3
charge 0 multiplicity 1
16 atoms
Cl 1.824981 -1.598471 0.713176
O  -1.615876 -0.100275 -0.450523
O  1.612668 1.536969 0.385096
C  0.645892 0.727855 -0.362776
C  -0.66462 0.582923 0.430898
C  1.231237 -0.611802 -0.811031
C  -2.910394 -0.323814 0.191997
H  0.434561 1.309828 -1.279312
H  -0.496426 -0.00716 1.35874
H  -1.03101 1.59354 0.706881
H  0.47406 -1.243378 -1.295418
H  2.135134 -0.485212 -1.42285
H  2.011832 0.955979 1.087202
H  -2.807371 -0.960611 1.095687
H  -3.539067 -0.839081 -0.550732
H  -3.390301 0.635009 0.480367
