program: Gaussian 09
title: 000098002
version: EM64L-G09RevD.01
frameworkgroup: C1[X(C14H11NO3)]
method: RPBEPBE
basis: SDD
operation: Freq
keyword: #p
keyword: freq=noraman
keyword: PBEPBE/SDD
title: #p freq=noraman PBEPBE/SDD
converged: YES YES NO NO
title: Mulliken charges:
elementType: O O O N C C C C C C C C C C C C C C H H H H H H H H H H H
charge: -0.292601 -0.209545 -0.208107 0.027401 -0.275590 -0.269915 0.486613 0.482783 -0.377711 -0.339355 -0.402646 -0.367061 -0.360974 -0.359600 0.372589 -0.228221 -0.231611 -0.234297 0.251969 0.244176 0.247650 0.277389 0.234328 0.262170 0.287642 0.287097 0.231255 0.230676 0.233498
chargesum: 0.00000
title: Mulliken charges with hydrogens summed into heavy atoms:
elementType: O O O N C C C C C C C C C C C C C C
charge: -0.292601 -0.209545 -0.208107 0.027401 -0.023621 -0.025739 0.486613 0.482783 -0.130062 -0.061966 -0.168318 -0.104891 -0.073332 -0.072503 0.372589 0.003033 -0.000934 -0.000800
polarizability: 3.00684204e+02 -4.48479084e+00 1.25338975e+02 -1.23513899e+01 6.84365456e+00 1.24091909e+02
1716.lowfreq: -5.2211 -0.0010 -0.0008 -0.0006 2.8249 3.8842 27.9891 34.9664 39.8190
frequency: 27.9666 34.9652 39.8044 66.6853 74.5791 125.4025 140.3655 184.1707 242.1667 252.7402 338.8631 350.0481 380.9029 402.3680 410.5910 456.9308 494.5120 508.7939 520.0654 600.5148 614.1132 622.9101 647.5865 670.5203 702.4435 729.4250 741.0621 770.6058 771.1985 801.2603 828.2519 839.5572 854.6995 855.3178 881.3509 926.1186 978.6278 987.2153 988.8175 999.1730 1000.4164 1004.8702 1025.1104 1056.7224 1069.6815 1083.2081 1092.2397 1108.6438 1152.8022 1174.4219 1177.4343 1185.4529 1220.3912 1229.4617 1239.1136 1287.8042 1305.3716 1328.7379 1361.1673 1376.6483 1391.9848 1407.5260 1423.9948 1445.4724 1483.5148 1486.1534 1592.8464 1594.3857 1610.8757 1615.2104 3081.6652 3089.8230 3120.0064 3130.8089 3139.1066 3141.8232 3153.0059 3156.4842 3167.6842 3183.0808 3185.6581
redmass: 4.5288 6.8745 6.0927 6.4351 5.4711 5.5370 6.4484 6.2541 6.0016 6.1400 5.5865 5.4228 6.3841 2.8443 2.9453 7.7537 3.7727 6.4006 3.3357 6.0351 6.4600 7.0667 6.6231 4.8765 1.9956 3.9580 3.3211 2.8917 7.6528 4.7087 3.4412 3.5223 1.3762 1.2563 1.8159 1.4481 1.3961 1.3432 5.8280 1.3198 1.3892 2.7880 2.1812 1.2597 1.3020 1.5529 3.3137 1.3424 3.5428 1.0553 1.3012 1.1151 5.5658 2.0953 1.4968 1.4894 1.4507 1.4403 4.4881 4.2016 4.4743 7.1182 2.9828 2.1920 2.6050 2.4361 6.0896 7.7104 6.2049 6.0501 1.0909 1.0882 1.0877 1.0864 1.0907 1.0913 1.0961 1.0899 1.1015 1.0945 1.0958
irintensity: 0.0481 0.7239 0.1557 1.2025 1.7968 0.5964 4.1069 5.7181 1.7256 0.9999 1.3573 1.3847 0.3226 0.2261 0.1408 8.6936 5.6095 1.9164 18.7048 19.4171 0.0782 0.3681 1.6210 24.9069 35.8342 38.4391 37.2665 38.3390 23.5513 41.3282 14.1804 4.2025 1.0940 0.2376 29.6850 1.1962 0.1120 3.2010 0.7155 0.2393 0.5416 2.7329 9.9939 11.3963 3.0999 12.3329 21.9289 20.5251 3.9287 0.3223 67.5857 7.1934 395.4039 10.7529 3.9835 2.8939 4.9849 2.4299 71.0633 37.6415 5.5410 0.5718 51.8135 15.3896 11.5384 8.6251 1.4614 1.5955 100.8430 7.4977 2.2503 26.4597 8.1463 0.1411 8.4947 11.6666 27.1360 0.7797 26.5027 0.4320 2.1319
temp: 298.150 k
press: 1.00000 atm
elementType: 8 8 8 7 6 6 6 6 6 6 6 6 6 6 6 6 6 6 1 1 1 1 1 1 1 1 1 1 1
symmnumber: 1
zpe: 567888.2 jmol-1
zpe.correction: 0.216297 hartree
zpe.thermalcorrener: 0.231088 hartree
zpe.thermalcorrenthalpy: 0.232032 hartree
zpe.thermalcorrgfe: 0.171852 hartree
zpe.sumelectzpe: -819.134049 hartree
zpe.sumelectthermal: -819.119259 hartree
zpe.sumelectthermalent: -819.118314 hartree
zpe.sumelectthermalfe: -819.178494 hartree
dipole: 6.0348 -1.4145 -0.3804
dipole: 6.2100
quadrupole: -130.0294 -106.9122 -97.1169
quadrupole: -8.9800 3.1637 1.0155
quadrupole: -18.6766 4.4407 14.2359 -8.9800 3.1637 1.0155
hfenergy: -819.3503461 hartree
pointgroup: C01 [X(C14H11N1O3)]
dipole: -2.3803415 0.4774427 -0.2743449 debye
polarizability: 300.9315953|0.2464095|121.5980855|11.4365944|-6.0412812|127.5854066 unknown
InChI: InChI=1S/C14H11NO3/c16-15(17)12-8-6-11(7-9-12)14-13(18-14)10-4-2-1-3-5-10/h1-9,13-14H
charge 0 multiplicity 1
29 atoms
O  -1.179318 -1.850101 0.037863
O  5.585495 1.290023 -0.695202
O  5.652485 -0.20705 1.025183
N  5.027836 0.428089 0.089501
C  -0.613411 -0.61664 -0.61512
C  -1.59408 -0.486997 0.541908
C  0.84666 -0.368856 -0.439744
C  -3.014526 -0.078354 0.337516
C  1.510058 0.563433 -1.28121
C  1.580844 -1.045694 0.570352
C  -3.567042 0.952681 1.139678
C  -3.818659 -0.697241 -0.654003
C  2.880419 0.833976 -1.112596
C  2.952085 -0.790133 0.748938
C  3.582754 0.152726 -0.093851
C  -4.900758 1.372531 0.941962
C  -5.152776 -0.280441 -0.845916
C  -5.696228 0.758776 -0.053209
H  -1.024448 -0.420028 -1.615227
H  -1.15056 -0.23377 1.515671
H  0.950116 1.079785 -2.069259
H  1.067548 -1.792947 1.184289
H  -2.954399 1.426007 1.917139
H  -3.400708 -1.524889 -1.238106
H  3.411596 1.548631 -1.746509
H  3.541067 -1.30232 1.514128
H  -5.319963 2.17018 1.564944
H  -5.772469 -0.768354 -1.60631
H  -6.732718 1.080278 -0.20331
