program: Gaussian 09
title: 000098004
version: EM64L-G09RevD.01
frameworkgroup: C1[X(C11H14O3)]
method: RPBEPBE
basis: SDD
operation: Freq
keyword: #pfreq=noraman
keyword: PBEPBE/SDD
title: #p freq=noraman PBEPBE/SDD
converged: YES YES NO NO
title: Mulliken charges:
elementType: O O O C C C C C C C C C C C H H H H H H H H H H H H H H
charge: -0.260620 -0.449663 -0.248170 -0.038799 -0.272071 -0.646092 0.449152 -0.696356 0.295760 -0.364210 -0.418142 -0.220712 -0.220492 -0.243204 0.203903 0.258285 0.210993 0.244045 0.236850 0.215704 0.214091 0.235965 0.261801 0.231406 0.226038 0.225034 0.227685 0.341820
chargesum: 0.00000
title: Mulliken charges with hydrogens summed into heavy atoms:
elementType: O O O C C C C C C C C C C C
charge: -0.260620 -0.107843 -0.248170 0.165104 0.197208 -0.165197 0.449152 -0.030596 0.295760 -0.102410 -0.186736 0.005326 0.004542 -0.015519
polarizability: 1.60849708e+02 2.01374951e+00 1.20167032e+02 1.50500456e+01 -7.38522149e+00 9.44306772e+01
1716.lowfreq: -10.7332 -3.1306 -0.0009 -0.0008 -0.0005 2.5309 10.3318 21.1168 29.5078
frequency: -3.4457 20.9627 29.4488 45.5134 76.0880 116.9251 194.4849 217.3100 241.2313 245.0557 282.7188 302.5823 318.5307 401.9042 404.3813 437.0424 465.1012 484.5949 521.9469 604.8987 619.6226 697.4424 710.7254 753.1901 810.9208 816.2536 832.9128 853.7460 898.2280 918.3285 933.4965 943.6487 976.9325 982.9431 990.1331 995.6099 1028.3491 1074.0005 1078.2205 1089.6857 1102.1339 1110.6834 1172.0442 1189.8825 1202.1921 1208.6524 1224.2461 1253.3122 1285.1636 1300.2865 1332.9545 1344.4944 1383.6243 1386.2868 1390.9675 1440.2036 1452.2605 1453.4477 1470.4667 1473.7377 1484.2462 1594.8663 1612.0161 1644.9999 2965.0451 2981.9435 3015.2721 3021.4539 3074.9376 3089.1211 3098.4306 3099.1742 3119.7694 3126.8646 3138.6328 3148.7696 3163.7347 3568.7612
redmass: 4.2757 4.6837 4.5268 5.0955 4.2092 4.8260 5.0750 1.2587 2.3993 1.2329 2.9987 5.1501 2.2880 2.7383 2.8156 2.3763 3.1700 3.7590 4.5164 5.0374 5.8158 3.6482 1.8967 2.2416 4.0883 3.1183 3.7753 1.2502 1.9343 1.5274 1.6830 1.9587 1.4067 3.8460 5.7045 1.3617 2.2283 2.1061 1.7389 1.9574 1.7950 2.0054 1.0549 1.1282 2.7225 1.2023 1.5604 1.1232 1.5331 1.3376 1.2738 1.3402 5.9096 1.5941 1.2963 2.0241 1.0943 1.1464 1.0606 1.0694 2.2245 6.1540 6.0616 9.6792 1.0840 1.0368 1.0622 1.0568 1.0990 1.1010 1.1063 1.0999 1.0853 1.0874 1.0923 1.0964 1.1017 1.0663
irintensity: 1.6105 0.2634 0.4617 0.2439 2.8696 2.3696 0.5573 0.4341 8.4299 142.5266 17.3140 4.9865 2.6007 18.7120 0.5066 18.8366 3.2357 0.5717 16.3345 8.7240 3.4466 6.4863 61.8838 39.2099 11.8077 30.4840 5.0791 0.4148 13.6007 2.2102 1.2759 5.1215 2.2094 103.5765 10.4487 1.6139 7.5044 4.4602 44.1999 62.1383 185.0035 54.1350 1.0499 3.1586 5.6415 13.1560 131.8831 24.7606 59.9463 15.2157 8.8308 17.1340 0.1415 28.7849 4.2155 9.1384 12.1572 19.6568 11.9015 9.7428 22.0802 2.7041 14.3658 160.7567 40.8572 21.3339 10.5011 33.4168 32.0856 23.1720 18.0642 9.6959 4.3363 1.0420 22.1074 31.3668 21.3183 5.0449
temp: 298.150 k
press: 1.00000 atm
elementType: 8 8 8 6 6 6 6 6 6 6 6 6 6 6 1 1 1 1 1 1 1 1 1 1 1 1 1 1
symmnumber: 1
zpe: 595382.6 jmol-1
zpe.correction: 0.226769 hartree
zpe.thermalcorrener: 0.240269 hartree
zpe.thermalcorrenthalpy: 0.241213 hartree
zpe.thermalcorrgfe: 0.184414 hartree
zpe.sumelectzpe: -652.179429 hartree
zpe.sumelectthermal: -652.165929 hartree
zpe.sumelectthermalent: -652.164985 hartree
zpe.sumelectthermalfe: -652.221784 hartree
dipole: 2.0067 -3.1237 0.1182
dipole: 3.7146
quadrupole: -62.7017 -84.4661 -79.6242
quadrupole: -6.5798 2.4781 -0.9959
quadrupole: 12.8956 -8.8687 -4.0269 -6.5798 2.4781 -0.9959
hfenergy: -652.4061982 hartree
pointgroup: C01 [X(C11H14O3)]
dipole: -0.7963422 1.0710072 0.595455 debye
polarizability: 160.6972971|8.9507653|109.1438137|-12.7014416|14.6377433|105.606306 unknown
InChI: InChI=1S/C11H14O3/c1-9(12)8-14-11(13)7-10-5-3-2-4-6-10/h2-6,9,12H,7-8H2,1H3
charge 0 multiplicity 1
28 atoms
O  -1.558141 0.158306 0.288101
O  -4.228972 -0.972192 0.694196
O  -0.759409 -1.616581 -1.010043
C  -3.990663 0.409508 0.233379
C  -2.723868 0.337018 -0.616923
C  0.441189 -0.940171 1.04186
C  1.765752 -0.388768 0.508709
C  -5.185249 0.944999 -0.579467
C  -0.66408 -0.875429 -0.006958
C  2.401595 -0.990481 -0.607965
C  2.377409 0.72864 1.128311
C  3.628744 -0.484263 -1.089769
C  3.607458 1.23475 0.647351
C  4.237607 0.628702 -0.463098
H  -3.796318 1.073658 1.103078
H  -2.771631 -0.511098 -1.322255
H  -2.561224 1.282406 -1.163038
H  0.56104 -2.005852 1.311226
H  0.123395 -0.384963 1.937908
H  -6.101626 0.960315 0.038993
H  -5.000933 1.977352 -0.93071
H  -5.376817 0.301601 -1.456685
H  1.924218 -1.8438 -1.10326
H  1.890326 1.204329 1.988192
H  4.109925 -0.9575 -1.953263
H  4.070231 2.098491 1.138223
H  5.191029 1.018989 -0.836691
H  -4.978185 -0.976967 1.341699
