program: Gaussian 09
title: 000010982
version: EM64L-G09RevD.01
frameworkgroup: C1[X(C8H19N)]
method: RPBEPBE
basis: SDD
operation: Freq
keyword: #pfreq=noraman
keyword: PBEPBE/SDD
title: #p freq=noraman PBEPBE/SDD
converged: YES YES NO NO
title: Mulliken charges:
elementType: N C C C C C C C C H H H H H H H H H H H H H H H H H H H
charge: -0.563241 -0.391713 -0.397098 -0.029054 -0.358096 -0.091027 -0.715213 -0.716671 -0.709945 0.193595 0.192543 0.206349 0.189955 0.196589 0.183812 0.179471 0.202206 0.209333 0.211743 0.211392 0.212195 0.212698 0.210425 0.240087 0.205916 0.196420 0.266130 0.251198
chargesum: 0.00000
title: Mulliken charges with hydrogens summed into heavy atoms:
elementType: N C C C C C C C C
charge: -0.045913 -0.005575 -0.000794 0.167536 0.005187 0.111179 -0.082745 -0.081354 -0.067522
polarizability: 1.10188680e+02 -1.59073183e+00 8.90819980e+01 -2.31162857e+00 -4.74959389e-01 8.40926752e+01
1716.lowfreq: -28.9720 -6.5805 -0.0006 -0.0005 -0.0004 13.2568 28.1834 59.2747 98.6043
frequency: 20.6141 58.9299 98.5472 109.6518 131.8854 212.0972 222.5745 233.3055 235.6536 244.6773 286.2128 354.7087 361.6826 388.6301 442.5702 458.6640 551.0962 627.4548 734.4996 775.4196 816.3350 847.2497 909.8356 928.0792 950.9740 957.4736 970.9095 984.7179 998.6766 1043.2809 1066.3260 1113.4614 1138.7303 1157.7851 1183.0843 1192.6443 1231.0976 1235.0140 1276.0119 1289.6846 1296.4403 1321.8904 1333.1809 1335.7348 1358.9411 1367.1266 1375.2170 1383.1455 1393.0213 1450.7406 1456.6336 1465.7061 1467.1839 1475.8162 1478.0109 1479.0844 1485.8661 1490.2383 1633.8267 2942.6725 2944.8443 2959.9367 2964.4846 2968.6019 2968.6538 2973.2564 2973.8743 2991.1604 3003.5894 3032.9305 3062.6350 3064.3229 3065.3513 3067.6986 3070.1786 3095.4052 3428.5188 3558.9209
redmass: 2.6077 2.9134 3.1038 1.7621 2.1634 2.1706 1.0982 1.1710 1.1448 1.0505 2.9421 2.0930 2.1526 2.3131 1.8664 2.4177 2.3127 1.5086 1.1415 2.8737 1.7506 1.8110 1.1903 1.9215 1.3988 1.7166 1.5142 1.7398 1.7132 1.4450 2.4331 1.7634 1.9414 2.4225 1.6422 1.8966 1.5109 1.3866 1.2346 1.1305 1.3831 1.4767 1.4060 1.4340 1.4059 1.4028 1.2181 1.2564 1.2172 1.0831 1.0730 1.0458 1.0474 1.0640 1.0521 1.0844 1.0487 1.0558 1.0948 1.0611 1.0651 1.0636 1.0685 1.0638 1.0391 1.0386 1.0523 1.0967 1.1017 1.1043 1.0997 1.0996 1.0968 1.0989 1.0985 1.0998 1.0445 1.0965
irintensity: 0.1109 0.2822 0.2389 0.1454 1.1717 4.2508 1.9520 0.4092 42.7737 0.0764 6.2039 0.5284 1.1272 1.5307 30.1707 9.1065 11.7273 284.1774 5.7977 0.1946 0.4198 1.3603 1.6879 1.7335 2.8302 1.1627 2.7835 0.1653 1.4670 4.4111 0.7100 4.9741 26.7031 15.2360 4.6799 6.9345 10.0999 5.9526 3.9590 1.1510 5.6744 1.4873 2.4188 3.9157 2.9931 2.0140 22.2394 24.6174 15.4648 1.1274 2.9121 1.9686 9.6514 1.5447 8.9495 6.2259 18.0953 16.7382 30.1475 8.4030 20.3679 6.5482 90.9062 9.4767 46.8155 9.1804 69.1248 12.6695 0.9939 108.4823 12.3833 8.8945 80.2796 74.6336 99.4215 34.3524 3.5723 0.2237
temp: 298.150 k
press: 1.00000 atm
elementType: 7 6 6 6 6 6 6 6 6 1 1 1 1 1 1 1 1 1 1 1 1 1 1 1 1 1 1 1
symmnumber: 1
zpe: 676040.1 jmol-1
zpe.correction: 0.257490 hartree
zpe.thermalcorrener: 0.270048 hartree
zpe.thermalcorrenthalpy: 0.270992 hartree
zpe.thermalcorrgfe: 0.218446 hartree
zpe.sumelectzpe: -370.214491 hartree
zpe.sumelectthermal: -370.201933 hartree
zpe.sumelectthermalent: -370.200989 hartree
zpe.sumelectthermalfe: -370.253535 hartree
dipole: -1.2146 -0.2447 -0.8570
dipole: 1.5065
quadrupole: -66.0322 -59.1956 -60.1264
quadrupole: -2.2515 -3.4430 -2.0059
quadrupole: -4.2475 2.5892 1.6583 -2.2515 -3.4430 -2.0059
hfenergy: -370.4719814 hartree
pointgroup: C01 [X(C8H19N1)]
dipole: -0.4824722 0.1036028 0.3283258 debye
polarizability: 110.1009232|1.898924|89.0773522|2.5344096|-0.6129042|84.185078 unknown
InChI: InChI=1S/C8H19N/c1-7(2)5-4-6-8(3)9/h7-8H,4-6,9H2,1-3H3
charge 0 multiplicity 1
28 atoms
N  2.607885 -1.443416 -0.376632
C  -1.307636 0.682835 0.68398
C  -0.117914 0.07513 -0.096446
C  -2.724993 0.206453 0.252492
C  1.247076 0.574794 0.428656
C  2.472941 0.034659 -0.370565
C  -2.940614 -1.306086 0.505222
C  -3.047339 0.572059 -1.217129
C  3.78738 0.644102 0.15874
H  -1.262929 1.788518 0.590079
H  -1.173377 0.457866 1.763192
H  -0.20406 0.329242 -1.172836
H  -0.154135 -1.030987 -0.025341
H  -3.44689 0.754343 0.895837
H  1.363397 0.287986 1.496313
H  1.260719 1.685013 0.397124
H  2.347416 0.343363 -1.42938
H  -2.289726 -1.920038 -0.145105
H  -2.719985 -1.573094 1.556151
H  -3.987192 -1.595657 0.294025
H  -2.885588 1.650076 -1.406767
H  -2.411365 0.004133 -1.921642
H  -4.101144 0.338647 -1.45924
H  4.641926 0.286631 -0.440547
H  3.759141 1.748213 0.121435
H  3.958191 0.346916 1.21274
H  1.818828 -1.933789 -0.811808
H  2.823286 -1.829812 0.550851
