program: Gaussian 09
title: 000097978
version: EM64L-G09RevD.01
frameworkgroup: C1[X(C5H9NO4)]
method: RPBEPBE
basis: SDD
operation: Freq
keyword: #pfreq=noraman
keyword: PBEPBE/SDD
title: #p freq=noraman PBEPBE/SDD
converged: YES YES NO NO
title: Mulliken charges:
elementType: O O O O N C C C C C H H H H H H H H H
charge: -0.255780 -0.214888 -0.180363 -0.188181 0.128018 -0.175474 -0.676234 0.273094 -0.227204 -0.670373 0.290019 0.257200 0.225891 0.257891 0.231340 0.241838 0.216506 0.237725 0.228973
chargesum: 0.00000
title: Mulliken charges with hydrogens summed into heavy atoms:
elementType: O O O O N C C C C C
charge: -0.255780 -0.214888 -0.180363 -0.188181 0.128018 0.114545 0.064748 0.273094 0.245975 0.012832
polarizability: 9.74375781e+01 -3.63753584e+00 6.89690489e+01 5.74123857e+00 -4.22980075e-01 6.37800755e+01
1716.lowfreq: -11.4009 -6.0193 -1.9739 0.0004 0.0009 0.0010 17.8877 39.4101 68.5042
frequency: 17.6644 39.3882 68.4965 106.6572 135.5307 192.0359 206.8984 251.8862 270.7628 282.9078 337.3215 375.8766 448.3953 516.9219 636.7076 669.8703 742.2560 784.5085 798.9004 810.5160 871.1826 1013.4173 1021.7307 1076.9416 1109.1954 1115.8760 1135.5451 1149.1470 1202.3341 1250.0308 1284.7366 1315.0404 1358.5499 1393.3934 1402.6679 1420.6583 1463.4742 1469.4870 1472.2904 1473.7651 1484.7554 1648.6699 2998.5625 3011.0096 3015.0446 3055.6982 3075.5816 3095.1563 3109.7934 3111.3565 3128.7917
redmass: 5.4264 3.8281 3.1968 4.1705 3.4908 2.2080 1.0730 1.7799 4.5106 2.8964 4.2732 6.2298 5.0959 7.1204 5.8996 4.5209 6.0276 5.8951 1.1204 3.2004 3.9852 1.9804 1.9473 1.5544 4.2809 2.3133 1.4686 2.3836 4.1601 1.1370 1.4635 1.9180 1.4575 1.2683 1.2639 6.6243 1.0396 1.0610 1.0643 1.0566 1.0656 10.1082 1.0359 1.0356 1.0583 1.0849 1.1066 1.0985 1.0994 1.1029 1.1018
irintensity: 1.7566 0.2045 2.6804 1.3998 2.0001 3.6942 0.2884 3.0528 9.8827 1.8524 3.2278 5.5288 6.3831 10.7605 4.1219 2.5913 2.6143 43.9625 3.0470 4.9649 7.8773 3.8795 51.2613 9.7984 224.1761 23.3774 7.0542 129.7727 63.0990 0.2955 12.5825 38.4910 1.4516 76.5728 18.7146 162.2502 12.3787 12.8840 11.0631 12.6508 15.9115 182.5070 17.5666 8.9402 14.2989 2.4855 4.5035 25.7409 7.6996 39.7165 4.2225
temp: 298.150 k
press: 1.00000 atm
elementType: 8 8 8 8 7 6 6 6 6 6 1 1 1 1 1 1 1 1 1
symmnumber: 1
zpe: 379380.0 jmol-1
zpe.correction: 0.144498 hartree
zpe.thermalcorrener: 0.155933 hartree
zpe.thermalcorrenthalpy: 0.156877 hartree
zpe.thermalcorrgfe: 0.105190 hartree
zpe.sumelectzpe: -550.697543 hartree
zpe.sumelectthermal: -550.686108 hartree
zpe.sumelectthermalent: -550.685163 hartree
zpe.sumelectthermalfe: -550.736851 hartree
dipole: 2.8668 1.7930 -2.5061
dipole: 4.2088
quadrupole: -54.3016 -62.6711 -60.7681
quadrupole: -6.9402 1.6298 -2.3239
quadrupole: 4.9453 -3.4242 -1.5212 -6.9402 1.6298 -2.3239
hfenergy: -550.8420408 hartree
pointgroup: C01 [X(C5H9N1O4)]
dipole: 1.3120924 0.9565348 0.3244993 debye
dipolederiv: -1.4829479 0.1175895 0.4325417 0.1327679 -0.3612328 0.0776499 0.4469084 0.0884984 -0.580321 -0.6191345 0.1141667 -0.0031098 -0.0767168 -0.435143 0.3449971 0.2629457 0.1682204 -0.7491328 -0.5209594 0.0996226 -0.1310523 0.2439059 -0.6308574 -0.1789475 -0.0374738 -0.2145845 -0.3368538 -0.7912637 0.2701296 -0.1565183 0.1152814 -0.4569948 -0.0984532 -0.2683348 0.0045524 -0.3542791 1.0985984 -0.2942177 0.3859147 -0.2495967 0.8961123 0.349495 0.3876839 0.2717189 0.4461297 -0.063627 0.0077991 -0.1308055 -0.0260708 0.0716193 -0.0693016 -0.1112852 -0.0162109 0.1215479 -0.1076072 0.0077467 -0.0052789 0.06033 0.0066805 -0.0224827 -0.0344254 -0.0146809 -0.0188671 1.4949683 -0.1574364 -0.2787365 0.0789694 0.3787328 -0.5182871 -0.578092 -0.3519006 1.0102306 0.8652987 -0.1137809 -0.1210662 -0.2220931 0.3415614 0.1044242 -0.0205528 0.0589798 0.2947915 -0.0946143 -0.002517 0.0841684 0.0111294 0.0537101 0.0124857 0.0789228 0.0119286 -0.01281 0.0650152 -0.0241981 0.0014017 -0.0229597 0.0568284 0.0394758 0.0134286 0.0469028 -0.0127533 0.1159352 -0.0095501 0.0324364 -0.0537058 -0.0010073 0.0905226 0.0450842 0.0430243 0.0376441 0.0548721 -0.092652 -0.0426211 -0.0878641 0.0171718 -0.0805388 -0.0383997 -0.0867307 0.0297264 -0.0154887 0.0916376 -0.0123642 0.0586379 0.095235 0.026145 -0.0409566 0.0457667 0.0883323 -0.0387824 0.0232329 0.0104815 0.0420156 0.0530796 -0.0658404 -0.0684128 -0.0236732 -0.1064835 -0.0474808 -0.072368 0.0245515 0.0152375 -0.0929472 -0.0090208 -0.0064066 -0.0029201 0.0741659 -0.0955787 0.1037075 -0.0030608 0.1181847 0.0361631 0.0280799 -0.0156329 0.0362684 0.0883368 0.0826711 -0.0298745 -0.0920876 -0.0436057 0.0936379 -0.0318848 -0.035019 -0.03459 -0.0996854 0.1001255 -0.0390376 0.0052053 -0.093847 -0.1223498 0.0014816 0.0200178 -0.0305698 0.0802809 unknown
polarizability: 94.2979413|-11.5861835|67.6514229|-1.7886762|2.390089|68.2373382 unknown
InChI: InChI=1S/C5H9NO4/c1-3-10-5(7)4(2)6(8)9/h4H,3H2,1-2H3
charge 0 multiplicity 1
19 atoms
O  1.631809 0.371678 -0.216362
O  0.545739 -0.585045 1.617757
O  -1.019005 -0.972051 -1.217955
O  -2.643923 0.623754 -1.157398
N  -1.507159 0.142997 -0.81192
C  -0.640739 1.01388 0.152808
C  -1.499674 1.53069 1.311158
C  0.547011 0.163871 0.61799
C  2.85048 -0.459181 0.061723
C  3.888105 -0.085061 -0.989569
H  -0.280493 1.833134 -0.493567
H  -1.773578 0.704592 1.987374
H  -0.922675 2.271885 1.890491
H  -2.409946 2.013912 0.923013
H  3.184374 -0.241675 1.092255
H  2.55013 -1.520741 0.008233
H  4.806992 -0.677998 -0.830664
H  3.512102 -0.293901 -2.005241
H  4.150849 0.984659 -0.925926
