program: Gaussian 09
title: 000097996
version: EM64L-G09RevD.01
frameworkgroup: C1[X(C14H22O)]
method: RPBEPBE
basis: SDD
operation: Freq
keyword: #pfreq=noraman
keyword: PBEPBE/SDD
title: #p freq=noraman PBEPBE/SDD
converged: YES YES NO NO
title: Mulliken charges:
elementType: O C C C C C C C C C C C C C C H H H H H H H H H H H H H H H H H H H H H H
charge: -0.229832 0.226548 -0.436554 0.199057 -0.454333 -0.496126 0.216008 -0.750648 -0.774649 -0.394590 -0.812126 0.240566 -0.794333 0.112231 -0.794159 0.198832 0.201779 0.208298 0.207730 0.218779 0.217546 0.212909 0.229404 0.222894 0.222216 0.214482 0.222057 0.238110 0.227763 0.243788 0.219847 0.231813 0.223908 0.252071 0.237671 0.232369 0.258673
chargesum: 0.00000
title: Mulliken charges with hydrogens summed into heavy atoms:
elementType: O C C C C C C C C C C C C C C
charge: -0.229832 0.226548 -0.035942 0.199057 -0.038305 -0.059800 0.216008 -0.085441 -0.115894 -0.156480 -0.120729 0.240566 -0.086542 0.112231 -0.065445
polarizability: 2.05849048e+02 6.33817826e+00 1.54565896e+02 -9.34267992e+00 2.88705255e+00 1.21010174e+02
1716.lowfreq: -18.2066 -9.4806 -7.2106 -0.0007 0.0002 0.0007 39.9465 51.3466 64.7819
frequency: 39.7017 51.3381 64.7401 90.7915 116.1975 135.1306 154.4382 172.1239 190.7040 194.2583 212.5668 248.8105 250.6361 267.0884 302.4780 314.3195 320.4252 360.1959 370.6142 397.8434 411.8448 417.4844 449.5591 480.7484 497.3518 557.2813 575.0916 596.1993 634.0278 700.0334 767.2012 793.4917 840.7306 865.8692 876.4242 899.3577 924.7676 925.7936 936.7481 978.5856 984.9278 991.9139 1007.3861 1013.2265 1031.7386 1046.6570 1049.2003 1082.4349 1103.1532 1124.9421 1152.8062 1177.5000 1199.4361 1200.3215 1211.1359 1256.5389 1270.4933 1287.5857 1338.2866 1341.7256 1350.0336 1359.0323 1371.8653 1376.6556 1390.5293 1392.8905 1399.0668 1447.7505 1449.0246 1450.1882 1454.1769 1455.0771 1464.0146 1464.9307 1467.4417 1469.9679 1476.3573 1477.8510 1481.8544 1490.0294 1568.7157 1615.3730 1632.5046 2943.6227 2961.6485 2964.6097 2969.5586 2973.2490 2982.7234 2983.4387 2986.3344 2998.4079 3026.8597 3028.7198 3046.3207 3062.8811 3064.0685 3067.6434 3072.2750 3073.3690 3075.7231 3096.8148 3099.2422 3104.3983 3119.8214
redmass: 2.9810 4.2543 4.3045 3.0123 2.6286 1.0396 2.4187 1.0991 1.3765 1.2619 1.7551 1.8274 1.8363 1.6541 2.0984 2.9088 2.6491 2.0160 3.0419 2.5743 2.6680 2.8777 3.0527 3.3817 2.5785 2.8285 3.3370 2.4615 3.6264 3.2060 3.3351 2.4672 1.5846 1.7626 2.1825 1.9667 2.0815 1.5848 1.9857 1.4620 1.5687 1.6192 1.3775 1.5460 1.9868 1.6016 1.6429 1.6402 2.1305 1.5945 2.3510 2.5045 2.1268 2.3440 2.1460 2.2710 1.4429 2.6103 1.4051 1.6124 1.5792 1.4049 1.2189 1.3391 1.2107 1.2255 1.4207 1.0974 1.0789 1.0862 1.0626 1.0737 1.0557 1.0509 1.0655 1.0767 1.0649 1.0769 1.0554 1.0591 6.7832 6.7515 6.6787 1.0622 1.0399 1.0590 1.0350 1.0374 1.0389 1.0747 1.0370 1.0829 1.0982 1.0958 1.1030 1.0991 1.0932 1.0985 1.1001 1.0974 1.0989 1.0967 1.0859 1.1008 1.0991
irintensity: 0.6459 3.0238 0.9404 2.8168 0.3504 0.8306 0.0274 0.9854 0.6668 1.1843 0.7792 0.4573 0.5896 0.2178 1.3150 2.4275 3.1577 2.3890 0.4825 5.3349 0.6885 2.8189 0.5781 2.8754 0.9919 7.0578 5.9275 4.5531 5.7525 0.5806 6.6303 2.5028 1.4989 6.8954 2.3252 12.3965 5.8472 3.2326 0.1385 19.4536 29.0256 10.2871 4.5908 1.6288 18.1895 4.5202 1.2562 2.7055 30.3510 2.7700 11.5146 8.1468 0.4257 10.0163 2.2712 154.1066 5.0750 21.1140 3.4935 0.3237 4.0344 8.7484 50.0070 41.4369 23.8688 6.9566 21.4226 23.2005 15.4647 27.3821 7.7059 8.6337 5.5594 19.4291 11.7325 3.1173 8.2514 19.7295 8.4743 11.4051 214.4317 57.1843 11.2358 32.2360 49.8887 30.7842 26.3713 35.5628 13.8562 17.7066 5.1855 48.1862 49.1452 25.3558 57.9060 1.8633 19.6878 80.9373 31.2227 11.8936 35.9050 18.3912 18.8576 9.6651 15.1042
temp: 298.150 k
press: 1.00000 atm
elementType: 8 6 6 6 6 6 6 6 6 6 6 6 6 6 6 1 1 1 1 1 1 1 1 1 1 1 1 1 1 1 1 1 1 1 1 1 1
symmnumber: 1
zpe: 846127.4 jmol-1
zpe.correction: 0.322273 hartree
zpe.thermalcorrener: 0.339598 hartree
zpe.thermalcorrenthalpy: 0.340542 hartree
zpe.thermalcorrgfe: 0.278203 hartree
zpe.sumelectzpe: -620.718108 hartree
zpe.sumelectthermal: -620.700784 hartree
zpe.sumelectthermalent: -620.699839 hartree
zpe.sumelectthermalfe: -620.762178 hartree
dipole: 4.1378 -0.7250 -1.4921
dipole: 4.4579
quadrupole: -108.7722 -88.5467 -92.9052
quadrupole: 5.6369 6.0700 0.2227
quadrupole: -12.0309 8.1947 3.8362 5.6369 6.0700 0.2227
hfenergy: -621.0403812 hartree
pointgroup: C01 [X(C14H22O1)]
dipole: -1.631865 -0.2331991 0.5989227 debye
polarizability: 205.0686795|-8.1511177|155.2318163|-10.4736493|-1.7270073|121.1246216 unknown
InChI: InChI=1S/C14H22O/c1-10-7-6-8-14(4,5)13(10)9-11(2)12(3)15/h9H,6-8H2,1-5H3
charge 0 multiplicity 1
37 atoms
O  4.231035 0.181209 -0.668228
C  -1.624913 -1.135397 -0.136796
C  -3.107882 -0.715576 0.084751
C  -0.652905 0.020878 0.238086
C  -3.404897 0.706544 -0.422702
C  -2.552643 1.71299 0.370615
C  -1.091472 1.30059 0.505759
C  -1.399979 -1.525355 -1.629061
C  -1.360713 -2.393008 0.744502
C  0.774327 -0.364486 0.333644
C  -0.197174 2.41118 1.024916
C  1.857114 0.205826 -0.301315
C  1.765641 1.341929 -1.297533
C  3.239351 -0.329103 -0.059062
C  3.469094 -1.479402 0.925884
H  -3.337858 -0.760336 1.169627
H  -3.762138 -1.457339 -0.413968
H  -4.479944 0.943577 -0.311941
H  -3.168665 0.78251 -1.501659
H  -2.980056 1.8492 1.388137
H  -2.592212 2.716739 -0.101007
H  -2.011197 -2.409937 -1.891971
H  -0.339317 -1.772067 -1.818308
H  -1.676758 -0.69982 -2.309347
H  -1.362563 -2.137631 1.820634
H  -0.400761 -2.883537 0.501783
H  -2.160585 -3.137322 0.570842
H  0.974765 -1.252925 0.948609
H  -0.008066 3.173707 0.242572
H  0.778099 2.043201 1.380445
H  -0.699513 2.937598 1.860444
H  2.096218 2.297752 -0.847812
H  0.733113 1.469914 -1.661952
H  2.446246 1.151508 -2.14489
H  3.143511 -1.208381 1.946743
H  2.914511 -2.3879 0.626361
H  4.545487 -1.70963 0.942699
