program: Gaussian 09
title: 000098013
version: EM64L-G09RevD.01
frameworkgroup: C1[X(C22H18O)]
method: RPBEPBE
basis: SDD
operation: Freq
keyword: #pfreq=noraman
keyword: PBEPBE/SDD
title: #p freq=noraman PBEPBE/SDD
converged: YES YES NO NO
title: Mulliken charges:
elementType: O C C C C C C C C C C C C C C C C C C C C C C H H H H H H H H H H H H H H H H H H
charge: -0.439727 0.360365 0.560168 -0.588303 0.123179 -0.403978 -0.315254 -0.410089 -0.348260 0.496618 -0.319311 0.498968 -0.334800 -0.396390 -0.410379 -0.395768 -0.409164 -0.238399 -0.240450 -0.238361 -0.240178 -0.246629 -0.247442 0.224570 0.228368 0.258929 0.215755 0.217851 0.210645 0.209781 0.228725 0.224802 0.221734 0.224744 0.224216 0.225301 0.224092 0.225432 0.228411 0.228759 0.361469
chargesum: 0.00000
title: Mulliken charges with hydrogens summed into heavy atoms:
elementType: O C C C C C C C C C C C C C C C C C C C C C C
charge: -0.078258 0.360365 0.560168 -0.363734 0.123179 -0.175610 -0.056325 -0.194335 -0.130409 0.496618 -0.108666 0.498968 -0.125019 -0.167665 -0.185577 -0.174034 -0.184420 -0.014183 -0.015149 -0.014268 -0.014746 -0.018218 -0.018683
polarizability: 5.67285928e+02 7.88336778e+00 3.13769519e+02 2.85528197e-01 2.13849080e-01 9.13969429e+01
1716.lowfreq: -4.8614 -3.3132 -0.0010 0.0001 0.0010 3.6215 12.9499 19.6593 31.5174
frequency: 12.7800 19.6114 31.5165 47.1867 56.8530 80.3575 93.3070 96.1198 153.8077 168.6343 187.5386 224.3203 235.1320 253.6440 278.9036 291.7162 355.5607 366.4662 403.2351 403.6978 412.3775 436.3463 448.2673 486.2907 494.6683 514.3230 523.7266 566.2690 605.9053 615.1828 615.7627 622.4068 634.4677 694.7463 695.5930 735.6076 766.1792 771.1067 773.0095 779.3247 803.6807 842.5442 845.1670 846.7532 860.7553 867.2215 886.0988 910.9531 925.0187 928.1286 930.7040 963.8917 974.7465 976.9670 980.7066 987.0750 987.2234 989.2197 995.6400 1001.9377 1026.0090 1026.5103 1074.8478 1082.5631 1083.8258 1160.4669 1171.5015 1172.0282 1176.9269 1191.1049 1191.2818 1209.6235 1232.6849 1236.0870 1261.1483 1281.3845 1301.7679 1305.2894 1315.6038 1335.3969 1338.8214 1342.3751 1383.8961 1386.6061 1400.6118 1423.7707 1440.9944 1442.6646 1482.1854 1486.3086 1502.3253 1579.8352 1580.8695 1587.2396 1600.3537 1609.5431 1614.6361 1644.6401 1646.4563 3086.7384 3087.1981 3097.5848 3110.6095 3115.4199 3115.6720 3123.9244 3124.8766 3129.4778 3136.9568 3136.9842 3140.3291 3146.8768 3149.2010 3153.9683 3164.1572 3164.2889 3587.6538
redmass: 3.6270 3.6833 5.7235 5.1470 4.9492 4.9758 3.7341 3.3648 5.4570 3.1123 5.9349 2.2199 5.9934 3.0173 5.8885 4.1587 1.1081 4.2385 2.8006 2.7899 4.7209 4.9637 2.9103 5.4816 2.8852 3.0466 5.8207 5.2259 3.3275 6.4385 6.4328 6.2684 6.3165 1.7409 1.6629 2.5149 1.7738 5.8070 2.0358 6.1775 1.5030 1.2961 1.2816 4.5525 4.1072 1.6275 1.7119 1.5652 1.6810 1.7882 1.3945 3.3324 1.3826 1.3911 1.1820 6.1296 6.0778 1.2589 1.2821 1.1811 2.2039 2.1826 2.4156 1.6289 1.6108 1.3414 1.0998 1.0646 1.4325 1.1304 1.1214 2.5662 1.7629 1.6027 1.7787 2.1278 1.5556 2.6736 1.4063 1.3839 1.2938 1.3148 6.3327 6.3034 4.9527 3.4683 2.3037 2.3960 2.2782 2.3675 2.8979 5.8051 5.6546 6.0395 5.7420 5.9168 6.0740 5.3254 5.3859 1.0895 1.0913 1.0859 1.0889 1.0869 1.0869 1.0856 1.0860 1.0900 1.0911 1.0906 1.0895 1.0959 1.0950 1.0942 1.1014 1.1014 1.0660
irintensity: 0.0006 0.0009 0.0544 1.3887 0.8859 0.4807 0.2353 0.4176 0.1828 0.0204 0.0528 0.5902 1.4474 0.1997 1.4728 1.2107 133.1520 1.8280 0.0093 0.0811 7.1271 7.7516 0.3240 27.1581 0.1399 33.7102 18.4517 21.1381 10.4696 0.3363 0.0596 1.2564 0.3693 94.8356 0.0199 29.8303 16.5117 10.0636 52.9876 5.7801 50.3697 0.0224 0.3504 2.6012 3.7484 4.6692 1.3258 3.8225 0.8507 2.7500 0.8563 4.0806 0.3536 0.0000 36.8413 0.1991 0.1972 24.2468 11.3819 51.9059 6.8176 7.8036 138.9899 10.3268 19.5521 92.8266 1.4165 0.8161 8.7748 1.9669 0.6023 15.7038 0.9239 18.0698 97.7568 13.5058 7.6809 3.4654 0.9949 5.9102 4.0971 1.4709 1.8902 2.4422 25.4453 32.7774 10.8166 9.5681 16.4619 13.1880 98.7529 3.5295 0.7322 3.0234 41.6804 6.0320 27.0047 8.9848 2.4104 20.9503 1.2332 43.2880 23.6601 13.0605 11.7676 2.6458 3.6949 8.3488 11.4891 26.0175 11.7473 43.1515 36.5533 11.6605 60.1028 22.3514 67.3470
temp: 298.150 k
press: 1.00000 atm
elementType: 8 6 6 6 6 6 6 6 6 6 6 6 6 6 6 6 6 6 6 6 6 6 6 1 1 1 1 1 1 1 1 1 1 1 1 1 1 1 1 1 1
symmnumber: 1
zpe: 858670.4 jmol-1
zpe.correction: 0.327050 hartree
zpe.thermalcorrener: 0.346833 hartree
zpe.thermalcorrenthalpy: 0.347777 hartree
zpe.thermalcorrgfe: 0.275203 hartree
zpe.sumelectzpe: -922.773805 hartree
zpe.sumelectthermal: -922.754023 hartree
zpe.sumelectthermalent: -922.753079 hartree
zpe.sumelectthermalfe: -922.825653 hartree
dipole: 0.5860 1.6000 -0.0005
dipole: 1.7039
quadrupole: -121.1395 -102.9866 -147.4549
quadrupole: 0.8078 0.0648 0.0704
quadrupole: 2.7208 20.8737 -23.5945 0.8078 0.0648 0.0704
hfenergy: -923.1008557 hartree
pointgroup: C01 [X(C22H18O1)]
dipole: -0.2352352 0.6276828 -0.0092947 debye
polarizability: 567.382515|-5.9624179|313.6167566|1.9322623|-3.3133057|91.4531174 unknown
InChI: InChI=1S/C22H18O/c23-22-16-14-20(12-11-18-7-3-1-4-8-18)17-21(22)15-13-19-9-5-2-6-10-19/h1-17,23H
charge 0 multiplicity 1
41 atoms
O  2.201537 3.662861 -0.045678
C  1.268393 1.429886 -0.018294
C  -1.213879 1.129643 -0.021872
C  0.107733 0.610988 -0.010286
C  1.057823 2.843181 -0.038305
C  -1.370313 2.548368 -0.042164
C  2.642891 0.91146 -0.007258
C  -0.246981 3.390599 -0.050148
C  -2.346083 0.191244 -0.012227
C  4.389553 -0.931478 0.021343
C  3.013999 -0.408201 0.010117
C  -4.81165 -0.432604 -0.014635
C  -3.679512 0.508084 -0.024839
C  5.548916 -0.099177 0.01559
C  4.585058 -2.343692 0.038992
C  -4.659288 -1.851181 0.01992
C  -6.137301 0.092047 -0.040181
C  6.840757 -0.659544 0.026892
C  5.878707 -2.905572 0.050363
C  -5.783214 -2.699727 0.027837
C  -7.263419 -0.756955 -0.032394
C  7.016035 -2.065628 0.044379
C  -7.093164 -2.16008 0.001678
H  0.233537 -0.478175 0.005432
H  -2.369571 2.994738 -0.051239
H  3.417191 1.686695 -0.014449
H  -0.380477 4.480571 -0.065504
H  -2.05987 -0.870255 0.006519
H  2.232617 -1.182243 0.016853
H  -3.968781 1.568929 -0.04551
H  5.439174 0.990663 0.002334
H  3.706857 -3.002021 0.043769
H  -3.657274 -2.293683 0.041403
H  -6.277783 1.180218 -0.066602
H  7.717365 -0.001553 0.022194
H  6.000459 -3.994539 0.06383
H  -5.642634 -3.78644 0.054698
H  -8.271073 -0.326749 -0.052683
H  8.023218 -2.496701 0.053041
H  -7.964499 -2.824153 0.007969
H  1.948846 4.618774 -0.059887
