program: Gaussian 09
title: 000097957
version: EM64L-G09RevD.01
frameworkgroup: C1[X(C7H15NO2)]
method: RPBEPBE
basis: SDD
operation: Freq
keyword: #p
keyword: freq=noraman
keyword: PBEPBE/SDD
title: #p freq=noraman PBEPBE/SDD
converged: YES YES NO NO
title: Mulliken charges:
elementType: O O N C C C C C C C H H H H H H H H H H H H H H H
charge: -0.246559 -0.438150 -0.108290 -0.337861 -0.345403 -0.339215 -0.319019 -0.314711 -0.083863 -0.695868 0.196711 0.207531 0.209938 0.194379 0.217745 0.180013 0.190938 0.215704 0.213860 0.191023 0.218756 0.243975 0.190672 0.233358 0.324335
chargesum: 0.00000
title: Mulliken charges with hydrogens summed into heavy atoms:
elementType: O O N C C C C C C C
charge: -0.246559 -0.113815 -0.108290 0.066381 0.058915 0.058544 0.087622 0.090172 0.134892 -0.027863
polarizability: 1.00109201e+02 -5.40430540e-01 8.66650543e+01 -1.42943619e+00 2.16418178e-01 7.67469193e+01
1716.lowfreq: -5.1273 -0.0005 -0.0005 0.0003 9.0778 21.1425 39.0001 66.0048 108.2381
frequency: 38.6991 65.9865 108.1845 186.7171 230.2681 237.4512 277.9470 301.7740 307.5091 339.9369 387.6372 416.7245 435.6365 467.7750 489.9825 605.6206 767.9790 807.9008 820.4923 839.6777 881.9728 917.2741 925.7783 1002.0788 1021.5112 1029.0510 1052.4490 1075.3606 1089.3052 1112.2449 1120.5763 1137.9634 1165.0870 1190.5745 1216.3112 1257.2870 1267.1421 1279.5992 1293.4382 1326.0129 1328.7905 1342.5849 1364.2093 1368.5804 1374.1251 1376.2826 1388.2660 1442.4947 1447.3926 1449.5972 1456.6236 1462.3401 1473.2495 1474.5208 2863.8948 2870.9815 2893.2102 2952.2925 2956.4340 2970.3018 2998.0387 3026.8071 3036.2273 3046.2164 3073.7170 3079.2180 3082.3658 3099.1862 3544.4553
redmass: 2.9846 3.9036 3.5057 3.1277 1.1644 1.6580 1.5037 2.3717 2.4181 2.2430 1.9595 2.9498 2.1741 2.7668 4.3889 1.8936 3.8292 3.7508 2.9394 1.6061 1.9246 2.2449 1.6070 2.5140 1.6329 2.1109 2.0318 2.5061 2.5546 2.4016 2.4964 2.6362 2.2179 1.0780 1.2585 1.3564 1.3981 1.3890 1.2758 1.3305 1.2974 1.2626 1.4058 1.2460 1.2226 1.2933 1.3680 1.0821 1.0802 1.0961 1.0862 1.0727 1.0818 1.0514 1.0704 1.0691 1.0666 1.0665 1.0666 1.0399 1.0914 1.0896 1.0896 1.0864 1.0937 1.0960 1.0978 1.1004 1.0659
irintensity: 1.2865 1.3127 3.2366 4.5903 7.2116 1.6734 42.4145 15.5353 84.0184 3.9100 2.0148 20.6604 5.2277 0.8453 1.9331 7.5206 6.4143 26.3431 9.4177 0.1253 4.2619 11.5613 9.1794 17.7675 103.2458 23.5032 21.4217 30.6707 33.4027 31.2351 34.2508 22.5471 6.6608 1.9755 7.3955 7.0380 15.8728 18.7886 1.8175 8.9858 0.2769 8.5599 2.2134 9.4842 8.4625 30.6666 11.3624 2.7726 2.1091 17.7151 5.0144 2.9362 18.9643 5.9531 49.9481 77.2901 119.5650 29.2249 107.3568 21.0909 19.0387 46.3897 35.8760 17.6958 61.8254 42.9103 35.1840 20.5828 4.6565
temp: 298.150 k
press: 1.00000 atm
elementType: 8 8 7 6 6 6 6 6 6 6 1 1 1 1 1 1 1 1 1 1 1 1 1 1 1
symmnumber: 1
zpe: 572636.3 jmol-1
zpe.correction: 0.218106 hartree
zpe.thermalcorrener: 0.229029 hartree
zpe.thermalcorrenthalpy: 0.229973 hartree
zpe.thermalcorrgfe: 0.181380 hartree
zpe.sumelectzpe: -480.064575 hartree
zpe.sumelectthermal: -480.053652 hartree
zpe.sumelectthermalent: -480.052708 hartree
zpe.sumelectthermalfe: -480.101301 hartree
dipole: 0.5915 -1.6828 0.7598
dipole: 1.9388
quadrupole: -76.0685 -55.6346 -63.5052
quadrupole: -4.7873 2.1317 1.7777
quadrupole: -10.9991 9.4348 1.5642 -4.7873 2.1317 1.7777
hfenergy: -480.2826808 hartree
pointgroup: C01 [X(C7H15N1O2)]
dipole: -0.2132571 0.5085258 0.5270268 debye
dipolederiv: -0.5501657 -0.0157939 -0.0798849 -0.0234169 -0.7415455 -0.1181228 -0.0891928 -0.1192443 -0.4688896 -0.8981225 -0.0107378 -0.0776138 -0.0165138 -0.2591219 0.2591097 -0.0705999 0.2302968 -0.5163091 -0.7710724 -0.0085609 -0.0065967 0.0014258 -0.4899418 0.0250188 0.0197195 -0.0017126 -0.5343795 0.0277441 -0.0970055 -0.1791342 -0.0916657 0.2772509 0.0526902 -0.2047238 0.0649654 0.4142244 0.1979752 0.2693222 -0.0388465 0.3082256 0.2949161 -0.057627 -0.0601555 -0.0612461 0.290074 0.4359328 -0.0996672 0.0607797 -0.1495238 0.0976618 -0.0137348 0.0797079 -0.0028037 0.2916364 0.3986195 0.2131482 0.0846378 0.1143064 0.5071455 0.0281423 0.0805223 -0.0376365 0.3429115 0.2653364 -0.143155 -0.0523386 -0.0796841 0.5110507 0.0871459 0.0276995 0.1412707 0.4422454 0.6724979 -0.0505037 0.0524466 -0.0674941 0.2930484 -0.1162293 0.0353158 -0.0803769 0.4157996 -0.0850525 0.0032782 0.0182384 -0.0235773 0.0842229 0.0468756 -0.0417671 0.0654783 -0.2259556 0.0068283 0.0529162 0.0466985 0.0312139 -0.0107727 0.1286614 0.0782162 -0.0240253 -0.2442955 -0.0243572 -0.1513243 -0.0305815 -0.1107871 -0.0668243 -0.0186445 0.0033674 -0.0151729 0.0608869 0.0242653 0.1066045 0.0661016 0.0314292 -0.0808434 -0.096411 0.0453072 -0.1052581 0.001415 -0.0376739 -0.0740437 -0.0046288 -0.0944541 -0.045134 0.0554621 0.0816666 0.1927199 -0.185468 -0.047705 -0.0002797 0.0416615 0.0005891 0.0480932 0.0282134 -0.0846931 0.0811277 -0.2317177 0.0067045 0.0419932 0.0047527 0.0702015 -0.1266604 -0.0626157 0.026991 -0.1127352 0.0328693 0.0111602 -0.0947123 0.0180847 -0.0479411 -0.0165967 0.0378822 0.0050999 0.1613731 -0.1591348 -0.0034651 0.0706766 0.0407472 0.0523077 -0.0693875 -0.0883202 0.0579723 -0.1319024 0.0114789 -0.0732164 -0.1100488 -0.0256666 -0.1101881 -0.0778437 -0.0437527 0.0132968 -0.0089764 0.0832666 0.0540275 0.0445015 0.0870913 0.0353388 -0.0154275 0.1039448 0.0076397 -0.002636 -0.2017759 0.0332738 0.0503033 -0.0006629 0.0583179 -0.1122844 -0.0550864 0.0212956 -0.0703819 -0.0053879 -0.0120237 0.0697943 -0.1241874 0.0710607 0.0763521 0.0178304 -0.117937 0.0107462 0.0632998 0.0775216 0.0451729 0.0330395 0.0880241 -0.1453607 -0.0952385 0.0112624 -0.0241942 0.0398863 -0.0472859 -0.1189781 0.0890135 -0.1261166 -0.005745 0.0522012 0.064402 0.0355686 0.047363 0.3382531 0.0070998 -0.0231511 0.0789222 0.0737481 -0.1573954 0.009587 -0.1852442 0.2359565 unknown
polarizability: 100.102687|-1.2430078|85.4969514|0.7673523|3.2578764|77.9215361 unknown
InChI: InChI=1S/C7H15NO2/c1-7(9)6-8-2-4-10-5-3-8/h7,9H,2-6H2,1H3
charge 0 multiplicity 1
25 atoms
O  3.033092 -0.302089 -0.134743
O  -3.569294 0.09847 -0.669991
N  0.170164 0.197467 -0.00678
C  0.726229 -0.908016 -0.83159
C  1.154211 1.307594 0.084125
C  -1.169261 0.641296 -0.460693
C  2.053456 -1.397099 -0.229367
C  2.473271 0.789734 0.680101
C  -2.30976 -0.302085 -0.001924
C  -2.463524 -0.35198 1.524461
H  0.900988 -0.575581 -1.886099
H  0.009089 -1.748957 -0.857387
H  0.743234 2.099609 0.738566
H  1.36247 1.759691 -0.918333
H  -1.231151 0.741091 -1.5717
H  -1.359353 1.64707 -0.032563
H  1.868377 -1.822515 0.780747
H  2.524405 -2.159217 -0.872136
H  3.244738 1.577517 0.687266
H  2.295764 0.429453 1.716632
H  -2.13731 -1.318659 -0.396509
H  -1.508003 -0.653523 1.987891
H  -2.731887 0.64656 1.925364
H  -3.253074 -1.066322 1.815334
H  -3.88677 0.942293 -0.256677
