program: Gaussian 09
title: 000097979
version: EM64L-G09RevD.01
frameworkgroup: C1[X(C14H11Cl3)]
method: RPBEPBE
basis: SDD
operation: Freq
keyword: #p
keyword: freq=noraman
keyword: PBEPBE/SDD
title: #p freq=noraman PBEPBE/SDD
converged: YES YES NO NO
title: Mulliken charges:
elementType: Cl Cl Cl C C C C C C C C C C C C C C H H H H H H H H H H H
charge: -0.048794 -0.056729 -0.056969 -0.312515 0.499683 0.581427 -0.682486 -0.386281 -0.384028 -0.370483 -0.361545 -0.220876 -0.227995 -0.231645 -0.235343 -0.112535 -0.230501 0.273175 0.263206 0.301476 0.243497 0.249653 0.260884 0.255781 0.255538 0.259371 0.235928 0.239108
chargesum: 0.00000
title: Mulliken charges with hydrogens summed into heavy atoms:
elementType: Cl Cl Cl C C C C C C C C C C C C C C
charge: -0.048794 -0.056729 -0.056969 -0.039340 0.499683 0.581427 -0.117805 -0.142783 -0.134375 -0.370483 -0.100661 0.034905 0.027543 0.027726 0.000584 -0.112535 0.008607
polarizability: 2.28232855e+02 -3.94529414e+00 1.63632458e+02 1.28079821e+01 9.80427291e+00 1.30744308e+02
1716.lowfreq: -5.2183 -2.8695 -0.0026 -0.0024 -0.0013 4.6877 26.4221 33.3137 40.3372
frequency: 26.3546 33.2087 40.3143 72.4986 76.2976 133.7226 144.0173 165.1319 191.3659 207.1183 267.6393 299.8190 306.4067 340.0431 391.3590 404.0785 407.3267 451.7472 480.9264 495.4126 536.4167 593.8532 625.4417 642.5371 657.6593 681.5575 723.6974 736.8177 761.3209 766.1446 817.0080 830.0546 854.3754 874.1642 940.3452 952.4063 956.9965 967.7275 992.3646 1000.9221 1012.5652 1038.0735 1047.5107 1076.8383 1111.4008 1119.8962 1153.9034 1172.3130 1186.7172 1192.5026 1212.5757 1236.6872 1278.9816 1299.0151 1300.9547 1336.3291 1369.5643 1382.0275 1398.8377 1425.2145 1455.7947 1459.1295 1482.4702 1572.9608 1587.4917 1600.0918 1603.8456 3014.5021 3059.1330 3130.5689 3135.4480 3139.3480 3147.1358 3150.2336 3161.9574 3169.2070 3173.9275 3176.5037
redmass: 8.5218 4.8489 8.6365 9.5418 7.0286 8.6494 5.2750 10.8489 4.0730 6.0161 5.8716 4.6693 6.2097 7.0213 8.4733 5.2792 2.9332 3.5508 4.1346 3.5479 3.7635 6.0211 6.8749 3.9465 6.4207 5.2510 3.9995 3.9162 2.6819 1.4095 2.1109 1.2557 2.1917 1.4451 1.7680 1.3941 1.3842 1.3770 1.3421 4.1343 6.8691 2.3953 3.5863 2.5820 1.3169 1.7585 1.1966 1.1307 2.0491 1.1337 2.3011 1.3786 1.2969 1.2683 1.2879 1.7404 6.6936 5.1037 2.4341 2.1592 2.0944 1.1920 2.3656 6.0903 7.2622 6.7652 6.2715 1.0824 1.0576 1.0899 1.0863 1.1095 1.0902 1.0884 1.0950 1.0954 1.0968 1.0998
irintensity: 0.2644 0.1861 0.4138 0.7268 0.1137 1.0478 0.2637 1.5126 0.8588 4.4344 0.7871 1.7865 0.5503 4.7277 8.6336 3.1438 0.7860 16.1313 7.3398 18.3840 3.9211 28.9577 1.0304 19.0469 12.9183 24.6419 7.5181 23.2387 17.2676 67.5855 23.4350 0.4563 26.5859 4.2408 12.2001 1.4495 2.2953 0.1222 0.8111 39.0266 51.0212 5.0437 10.7607 42.4211 7.7200 6.4750 3.5731 1.6945 0.2359 0.0788 1.7640 2.4427 1.9476 3.8622 14.2747 3.2404 4.0608 0.6594 5.0462 25.6038 32.1742 27.4624 73.4860 11.4354 3.3768 1.3752 7.9990 1.2830 14.3853 7.1323 0.4316 6.3364 6.0906 6.3260 11.6015 5.7759 1.7089 13.8313
temp: 298.150 k
press: 1.00000 atm
elementType: 17 17 17 6 6 6 6 6 6 6 6 6 6 6 6 6 6 1 1 1 1 1 1 1 1 1 1 1
symmnumber: 1
zpe: 540821.3 jmol-1
zpe.correction: 0.205988 hartree
zpe.thermalcorrener: 0.221568 hartree
zpe.thermalcorrenthalpy: 0.222512 hartree
zpe.thermalcorrgfe: 0.160215 hartree
zpe.sumelectzpe: -1919.073370 hartree
zpe.sumelectthermal: -1919.057790 hartree
zpe.sumelectthermalent: -1919.056846 hartree
zpe.sumelectthermalfe: -1919.119144 hartree
dipole: 2.4533 -3.0225 -1.4774
dipole: 4.1638
quadrupole: -125.3048 -123.9992 -113.8572
quadrupole: -7.6687 -0.5316 0.5741
quadrupole: -4.2511 -2.9454 7.1965 -7.6687 -0.5316 0.5741
hfenergy: -1919.2793584 hartree
pointgroup: C01 [X(C14H11Cl3)]
dipole: -1.2218508 0.9463337 -0.5432573 debye
polarizability: 224.8755153|6.4239348|162.8050177|-18.9411315|-14.6792688|134.9290888 unknown
InChI: InChI=1S/C14H11Cl3/c15-9-13(10-5-7-11(16)8-6-10)12-3-1-2-4-14(12)17/h1-8,13H,9H2
charge 0 multiplicity 1
28 atoms
Cl 0.555367 -3.724328 -0.330104
Cl -3.034416 -1.518749 1.876225
Cl 5.129599 1.71318 -0.165065
C  -0.36562 -1.086915 0.228101
C  1.012864 -0.434225 0.093897
C  -1.512804 -0.089157 -0.024649
C  -0.626191 -2.293196 -0.694757
C  1.462317 0.409373 1.142798
C  1.852857 -0.611305 -1.031896
C  -2.762016 -0.191646 0.636011
C  -1.383294 0.95347 -0.980924
C  2.708448 1.067503 1.07646
C  3.106144 0.037646 -1.119406
C  -3.834346 0.686678 0.390239
C  -2.44317 1.843924 -1.253124
C  3.513497 0.871556 -0.06285
C  -3.671443 1.713565 -0.566223
H  -0.470713 -1.455241 1.26634
H  -0.492404 -2.057325 -1.761624
H  -1.630024 -2.706424 -0.522436
H  0.830198 0.556544 2.026705
H  1.556546 -1.277478 -1.847863
H  -0.425361 1.070928 -1.498972
H  3.047099 1.712814 1.892057
H  3.753102 -0.111616 -1.988565
H  -4.775526 0.568602 0.934646
H  -2.309345 2.639472 -1.993479
H  -4.498467 2.402949 -0.765443
