program: Gaussian 09
title: 000010977
version: EM64L-G09RevD.01
frameworkgroup: C1[X(C5H11Cl)]
method: RPBEPBE
basis: SDD
operation: Freq
keyword: #pfreq=noraman
keyword: PBEPBE/SDD
title: #p freq=noraman PBEPBE/SDD
converged: YES YES NO NO
title: Mulliken charges:
elementType: Cl C C C C C H H H H H H H H H H H
charge: -0.090985 -0.317832 -0.335957 -0.342713 -0.586341 -0.691040 0.181540 0.212825 0.225822 0.200568 0.189270 0.196549 0.254570 0.264980 0.213574 0.209020 0.216151
chargesum: 0.00000
title: Mulliken charges with hydrogens summed into heavy atoms:
elementType: Cl C C C C C
charge: -0.090985 0.076533 0.090432 0.043106 -0.066791 -0.052295
polarizability: 7.17183100e+01 3.41654627e+00 6.37177516e+01 7.83875385e-01 2.10561823e+00 5.15844146e+01
1716.lowfreq: -2.7451 0.0011 0.0018 0.0028 11.8685 12.6500 67.9580 76.2495 131.5973
frequency: 67.8032 76.1705 131.5945 183.9662 222.5021 267.3370 384.2259 439.5754 592.8023 731.2141 782.9089 839.2496 910.3052 921.3795 988.5701 1052.1835 1065.6676 1095.7083 1112.6876 1183.2356 1210.8320 1265.5284 1276.9136 1291.0037 1301.7769 1342.3658 1364.3347 1390.4489 1445.1828 1449.9165 1468.0967 1476.1406 1477.0534 1487.4519 2955.1758 2961.9100 2969.9285 2974.0514 3006.2237 3023.3432 3043.9877 3051.5721 3070.6187 3073.8392 3129.4535
redmass: 1.7081 3.8564 2.6319 2.2274 1.1474 2.6192 2.7117 2.9515 4.3333 1.0919 1.2831 1.5110 1.5836 1.5073 2.0936 1.9394 1.5830 1.7305 2.1201 1.5615 1.4130 1.2444 1.2664 1.0761 1.1381 1.4446 1.6353 1.2206 1.0792 1.1017 1.0690 1.0646 1.0436 1.0829 1.0644 1.0597 1.0633 1.0362 1.0964 1.0933 1.0819 1.0779 1.1005 1.0995 1.1111
irintensity: 0.6019 1.4824 0.5456 0.9317 0.1255 1.4622 0.1963 3.4324 22.3638 15.0577 3.5938 3.2208 11.1266 8.0279 6.9514 4.9497 0.9676 3.0008 5.5215 0.9459 1.0776 3.7970 4.4693 2.0729 19.0931 1.3765 1.4626 11.4561 7.6519 6.5322 0.4599 3.9742 12.2748 18.2459 15.9963 9.9982 66.1559 36.0588 9.7675 6.8951 8.4902 57.6828 89.4125 52.5170 21.7946
temp: 298.150 k
press: 1.00000 atm
elementType: 17 6 6 6 6 6 1 1 1 1 1 1 1 1 1 1 1
symmnumber: 1
zpe: 392113.4 jmol-1
zpe.correction: 0.149348 hartree
zpe.thermalcorrener: 0.157414 hartree
zpe.thermalcorrenthalpy: 0.158359 hartree
zpe.thermalcorrgfe: 0.115960 hartree
zpe.sumelectzpe: -656.678237 hartree
zpe.sumelectthermal: -656.670171 hartree
zpe.sumelectthermalent: -656.669227 hartree
zpe.sumelectthermalfe: -656.711625 hartree
dipole: 1.3979 2.0222 0.4627
dipole: 2.5015
quadrupole: -50.2507 -44.6864 -45.2143
quadrupole: -3.5467 -0.9562 0.6792
quadrupole: -3.5335 2.0307 1.5028 -3.5467 -0.9562 0.6792
hfenergy: -656.8275853 hartree
pointgroup: C01 [X(C5H11Cl1)]
dipole: 0.4744263 0.8131081 0.2870002 debye
dipolederiv: -0.3531273 -0.1373494 -0.0261326 -0.2201348 -0.47984 -0.0705048 -0.0662391 -0.1033458 -0.2295923 -0.0404144 0.0210026 0.0272656 0.0072935 0.0409794 0.0387076 0.0276688 0.0599644 0.1515856 -0.0820268 -0.0087714 0.0276795 -0.1351381 0.0034878 0.0082522 0.0339674 -0.008676 0.0807993 0.0606595 0.0278091 0.0037209 0.0554453 0.1353305 0.0423992 -0.0178582 0.03859 0.1489029 0.3265672 0.246131 0.0684659 0.323424 0.6021112 0.1424537 0.0578284 0.1285525 0.2569144 -0.0505719 0.0563231 -0.0174461 0.0376594 0.0419335 0.0219159 0.0004967 0.0211968 0.0831948 0.0328131 0.0117431 0.0028261 0.0104595 0.0618134 0.0068834 0.0029487 0.0288677 -0.2015256 0.0665048 -0.0383023 -0.0050767 -0.0232654 -0.1170208 -0.0380274 -0.0073954 -0.0623099 0.0557881 0.0444547 0.0045204 0.0097433 0.038671 0.0915364 0.001999 -0.0078096 0.0508203 -0.1490494 0.0063584 -0.1071542 -0.0224205 -0.0106305 -0.1398129 -0.0621718 0.0095313 -0.0708407 0.0748914 0.0198855 -0.0131351 -0.0009159 -0.0493098 -0.1955213 -0.0497555 -0.0114727 -0.0806301 0.0541893 0.0300068 0.015064 -0.0392309 0.0063054 0.0645693 0.0162365 -0.0036377 0.0389705 -0.2026076 0.0694808 -0.0483002 -0.0385814 -0.0666416 -0.0066577 -0.0118554 0.0219322 -0.0210393 -0.1344737 -0.0956262 0.0537551 -0.038236 0.0613226 -0.0911032 -0.0153218 -0.0564393 0.0034091 0.075104 0.0746219 -0.0664944 -0.0327196 -0.0026119 -0.1547318 -0.0606258 -0.0255178 -0.0768397 0.0627684 0.084152 0.0150522 0.0064066 0.02329 0.0746763 -0.0057108 -0.05387 0.0238714 -0.1882471 -0.1937381 -0.0318936 0.0746517 -0.0561385 0.0682499 0.0351258 0.0958663 0.0294389 0.0613575 unknown
polarizability: 71.0241654|3.8115046|63.712137|1.6640358|3.6031218|52.2841737 unknown
InChI: InChI=1S/C5H11Cl/c1-2-3-4-5-6/h2-5H2,1H3
charge 0 multiplicity 1
17 atoms
Cl -2.665311 -1.097194 -0.369273
C  0.466899 -0.060637 0.248775
C  -0.653668 0.899083 -0.205646
C  1.854176 0.34594 -0.299015
C  -2.042469 0.557441 0.33308
C  2.9797 -0.608255 0.154616
H  0.50243 -0.087863 1.358177
H  0.221863 -1.088085 -0.084229
H  -0.688934 0.945037 -1.311416
H  -0.418486 1.928491 0.144385
H  2.089742 1.380162 0.026858
H  1.813221 0.370741 -1.407223
H  -2.051255 0.418521 1.425818
H  -2.807808 1.28786 0.029875
H  2.781211 -1.642567 -0.183848
H  3.063115 -0.627598 1.257758
H  3.960075 -0.300777 -0.253192
