program: Gaussian 09
title: 000098154
version: EM64L-G09RevD.01
frameworkgroup: C1[X(C18H18N2O4)]
method: RPBEPBE
basis: SDD
operation: Freq
keyword: #p
keyword: freq=noraman
keyword: PBEPBE/SDD
title: #p freq=noraman PBEPBE/SDD
converged: YES YES NO NO
title: Mulliken charges:
elementType: O O O O N N C C C C C C C C C C C C C C C C C C H H H H H H H H H H H H H H H H H H
charge: -0.395503 -0.234632 -0.272918 -0.331119 -0.364651 -0.370729 -0.123395 -0.641616 0.518520 0.164509 0.255890 -0.389793 -0.399532 -0.525041 -0.229453 -0.227722 -0.252072 0.222022 0.285979 -0.339289 -0.363954 -0.237401 -0.232040 -0.224672 0.300315 0.226340 0.255512 0.360368 0.234731 0.236796 0.249484 0.263226 0.225363 0.232230 0.320343 0.226927 0.382575 0.269080 0.217896 0.237481 0.233264 0.236679
chargesum: 0.00000
title: Mulliken charges with hydrogens summed into heavy atoms:
elementType: O O O O N N C C C C C C C C C C C C C C C C C C
charge: -0.012928 -0.234632 -0.272918 -0.331119 -0.004283 -0.050386 0.176920 -0.159764 0.518520 0.164509 0.255890 -0.155062 -0.162736 -0.012331 -0.004089 0.004508 -0.025145 0.222022 0.285979 -0.070209 -0.146058 0.000081 0.001224 0.012007
polarizability: 2.75048299e+02 2.69751611e+01 1.73195273e+02 1.72825902e-02 4.09519859e+00 1.87825894e+02
1716.lowfreq: -4.9826 -3.2897 -0.0004 0.0006 0.0008 7.4642 12.7427 18.8569 27.8506
frequency: 12.0194 18.6748 27.8302 28.8726 42.8482 45.7092 57.5397 71.6282 84.0676 99.4516 120.5456 150.2496 165.6138 194.9030 236.6956 256.0467 281.9368 313.4082 331.5130 341.8990 383.3932 401.1914 404.0108 422.8813 433.0474 474.2138 487.8453 504.5759 547.3259 559.4128 577.7767 593.0571 614.6854 617.4728 629.2055 652.3719 683.4592 687.0535 701.0046 704.6539 742.2380 759.5942 776.9842 793.0812 798.8352 801.2014 853.4526 855.4799 865.1725 882.0307 924.1714 933.7411 937.4950 976.0287 979.6088 985.8044 989.8652 990.8064 995.3610 1006.9053 1009.3994 1018.7661 1027.7967 1033.2764 1076.3583 1085.6575 1089.3017 1126.5974 1147.7149 1171.8892 1174.8438 1187.6673 1192.2774 1193.1715 1219.0473 1230.2614 1267.9571 1277.4259 1289.7535 1302.1710 1311.6302 1318.0122 1332.6686 1336.2959 1340.5471 1384.0800 1385.9197 1430.6101 1440.2894 1441.4481 1470.9648 1472.9698 1485.3232 1502.5408 1524.3811 1555.9467 1594.2772 1598.0869 1611.4426 1614.9738 1633.9275 1645.7799 2994.4764 3004.4559 3025.3395 3066.5947 3114.7090 3115.2171 3118.2973 3123.2551 3131.3524 3134.5027 3143.0542 3146.6636 3158.2103 3160.8166 3170.3734 3345.7242 3506.5196 3565.6649
redmass: 5.8928 5.6430 8.7964 4.4463 4.3099 5.5488 6.6395 5.5041 6.2709 6.6286 4.8838 6.1140 5.4740 4.7871 5.5230 4.5060 7.6658 6.3147 3.7957 2.7306 3.1231 2.7990 2.8262 5.2191 3.5261 3.4979 4.6443 4.1290 3.6734 1.4861 2.4430 3.5051 6.1896 6.1743 1.9811 4.6525 4.2640 2.9239 1.5604 1.7816 4.2528 1.8684 1.3505 2.4368 3.7691 3.6414 1.2548 1.2545 2.0473 3.1470 2.2603 2.5926 1.5744 1.4173 2.5807 1.4448 5.2946 5.7738 1.3162 1.4200 3.0350 2.6699 2.1689 2.1992 2.1825 1.5731 1.7429 2.7215 2.9881 1.0567 1.0600 1.1546 1.1708 1.3223 2.4045 1.4471 1.4287 1.9723 1.9606 1.3580 2.0478 1.3402 1.2788 1.2981 1.4129 7.5295 9.0898 1.7746 1.3160 2.1439 1.9303 1.1347 2.3263 2.2505 1.9920 4.3771 6.0481 6.3487 6.0336 6.1250 5.5923 9.3178 1.0728 1.0700 1.0620 1.1011 1.1022 1.0868 1.0867 1.0869 1.0913 1.0871 1.0960 1.0919 1.0956 1.1014 1.1013 1.0831 1.0638 1.0778
irintensity: 0.1315 0.1608 2.5617 0.3868 0.1897 0.9276 2.9111 3.4548 1.6514 9.6068 2.4643 0.5245 10.4604 8.6483 0.6909 2.1432 11.6159 2.7612 1.8241 0.0282 2.6253 0.7162 0.0304 5.7794 2.8242 1.0300 5.2150 45.2724 32.0136 112.6233 67.7938 24.5140 1.0929 0.4745 57.8213 25.6986 31.2734 38.2360 99.4847 48.2433 6.7655 76.5596 135.7893 15.3582 2.1100 30.1059 2.3885 0.2796 5.3958 9.8883 11.6282 3.3622 7.9379 0.1311 3.8763 0.6152 0.4100 0.3893 1.0677 0.9788 6.3108 11.1838 13.0224 4.9329 203.0323 15.2861 33.6173 7.1922 6.1245 1.0749 0.8584 1.2339 6.2322 4.4700 1.5491 31.7845 27.9002 2.5576 111.3950 1.1433 37.6168 1.3743 1.5095 8.5875 9.6234 0.0729 1.9966 8.6823 25.6271 5.4724 71.4208 40.9430 11.3137 109.8532 272.2906 35.2261 1.1279 13.1919 6.2807 7.1190 278.2714 250.2767 25.6606 5.5868 16.3060 9.3233 5.6247 6.4690 2.2424 6.8513 11.5252 1.0162 40.6207 15.5364 17.8499 19.4497 19.8488 220.5428 26.9965 20.2195
temp: 298.150 k
press: 1.00000 atm
elementType: 8 8 8 8 7 7 6 6 6 6 6 6 6 6 6 6 6 6 6 6 6 6 6 6 1 1 1 1 1 1 1 1 1 1 1 1 1 1 1 1 1 1
symmnumber: 1
zpe: 863623.8 jmol-1
zpe.correction: 0.328937 hartree
zpe.thermalcorrener: 0.350948 hartree
zpe.thermalcorrenthalpy: 0.351892 hartree
zpe.thermalcorrgfe: 0.273048 hartree
zpe.sumelectzpe: -1105.433275 hartree
zpe.sumelectthermal: -1105.411265 hartree
zpe.sumelectthermalent: -1105.410320 hartree
zpe.sumelectthermalfe: -1105.489164 hartree
dipole: 5.3803 -0.3716 0.1364
dipole: 5.3948
quadrupole: -130.1903 -136.3403 -139.4838
quadrupole: 7.9775 9.2713 0.5425
quadrupole: 5.1479 -1.0022 -4.1457 7.9775 9.2713 0.5425
hfenergy: -1105.7622124 hartree
pointgroup: C01 [X(C18H18N2O4)]
dipole: 2.1121973 -0.2014795 -0.0541907 debye
polarizability: 263.2520659|-41.0462062|183.5477043|-10.6927088|1.2079996|189.2696955 unknown
InChI: InChI=1S/C18H18N2O4/c21-16(12-19-17(22)14-9-5-2-6-10-14)20-15(18(23)24)11-13-7-3-1-4-8-13/h1-10,15,19-20,23H,11-12H2
charge 0 multiplicity 1
42 atoms
O  -3.756059 2.441159 1.779708
O  -5.17603 0.636542 1.457254
O  -2.073104 2.24839 -1.772702
O  0.817711 1.391278 1.695904
N  -1.729092 1.377196 0.372283
N  1.145083 1.98781 -0.51995
C  -2.951435 0.585297 0.39069
C  -2.699846 -0.889021 0.848932
C  -1.789995 -1.643466 -0.106666
C  -4.074702 1.191881 1.246168
C  -1.375029 2.140663 -0.718451
C  -2.29506 -2.148308 -1.332818
C  -0.418755 -1.83972 0.193922
C  -0.026793 2.881658 -0.546689
C  -1.45119 -2.831982 -2.235414
C  0.431158 -2.521861 -0.706979
C  -0.083421 -3.020743 -1.925411
C  1.525233 1.321112 0.628521
C  2.787578 0.508924 0.571149
C  2.993474 -0.45485 1.591692
C  3.773769 0.671722 -0.437558
C  4.150123 -1.260513 1.591044
C  4.932434 -0.134732 -0.437099
C  5.120695 -1.107309 0.572376
H  -3.337087 0.577962 -0.648921
H  -2.262488 -0.872454 1.865569
H  -3.688705 -1.375768 0.924287
H  -1.075207 1.361866 1.172628
H  -3.355376 -2.009381 -1.579816
H  -0.014792 -1.455471 1.13873
H  0.074959 3.578084 -1.392989
H  -0.041534 3.452175 0.399414
H  -1.858261 -3.218554 -3.176617
H  1.48903 -2.661817 -0.456033
H  1.596563 1.763782 -1.4073
H  0.571332 -3.553317 -2.624484
H  -4.53708 2.775835 2.300217
H  2.237994 -0.543299 2.379455
H  3.670064 1.446019 -1.207279
H  4.297894 -2.00362 2.381981
H  5.691312 0.001819 -1.215032
H  6.020733 -1.731886 0.571083
