program: Gaussian 09
title: 000097973
version: EM64L-G09RevD.01
frameworkgroup: C1[X(C13H17NO)]
method: RPBEPBE
basis: SDD
operation: Freq
keyword: #p
keyword: freq=noraman
keyword: PBEPBE/SDD
title: #p freq=noraman PBEPBE/SDD
converged: YES YES NO NO
title: Mulliken charges:
elementType: O N C C C C C C C C C C C C C H H H H H H H H H H H H H H H H H
charge: -0.315526 -0.024342 -0.127937 -0.450148 0.455642 0.067106 -0.418602 -0.447380 -0.369333 -0.697706 -0.692495 -0.218154 -0.234919 -0.240263 -0.160100 0.179279 0.244560 0.242144 0.205534 0.286584 0.234720 0.232161 0.256934 0.202833 0.230614 0.220381 0.217511 0.212715 0.221793 0.227507 0.228024 0.230865
chargesum: 0.00000
title: Mulliken charges with hydrogens summed into heavy atoms:
elementType: O N C C C C C C C C C C C C C
charge: -0.315526 -0.024342 0.051342 0.036556 0.455642 0.272640 0.102702 -0.215220 -0.112399 -0.043878 -0.040477 0.009353 -0.006895 -0.009399 -0.160100
polarizability: 1.72510881e+02 -7.35940945e+00 1.29483454e+02 6.30815826e-01 -1.01317621e+00 1.30353498e+02
1716.lowfreq: -17.8446 -9.3434 -0.0003 0.0003 0.0006 3.4938 11.0272 34.6545 52.6866
frequency: -11.6891 34.6406 52.5795 56.6474 60.2750 92.8095 147.9091 173.6043 181.9966 198.8491 223.2227 229.0223 271.8080 327.5246 357.2206 374.7894 404.0256 413.6171 448.0250 487.1925 525.9187 581.3901 615.4172 620.9077 708.3729 733.8368 772.0244 805.0867 817.9943 859.0269 879.1100 916.2273 925.3707 937.1493 944.3728 953.4317 981.5238 989.8706 999.4927 1024.4265 1033.3923 1036.2798 1073.7085 1087.5321 1109.4760 1147.1543 1169.2331 1172.6912 1182.6053 1185.0538 1212.6051 1246.0766 1276.5361 1293.5420 1303.5893 1329.3887 1333.6402 1344.7038 1353.1098 1378.6353 1387.6407 1392.4769 1441.7297 1450.4122 1455.3357 1460.6425 1464.4832 1472.3396 1480.3298 1484.8136 1594.3079 1612.3152 2196.3025 2928.1478 2965.9243 2981.2977 2989.9652 2992.6315 3014.5425 3055.6864 3075.2769 3083.0883 3083.5062 3091.4694 3096.5640 3111.7222 3124.6250 3136.0016 3147.1801 3163.8590
redmass: 2.5572 3.9664 4.5376 5.5340 4.0848 2.3886 4.3033 1.4626 1.8371 2.0182 4.1269 1.4319 4.5838 2.9757 3.1063 3.5827 2.8247 2.9031 3.3370 3.7346 3.3843 3.4319 6.3667 5.4265 1.7313 1.7140 1.8740 1.9874 3.9995 1.2521 2.5196 1.2453 1.4310 1.3644 4.1184 3.1847 1.3917 6.1953 1.3222 2.1897 2.9296 3.8104 2.0973 1.7846 1.7799 2.0089 1.5023 1.0767 1.2033 1.6020 2.3660 1.2718 1.1416 1.4519 1.1727 1.2772 1.4043 1.3285 1.4909 1.3079 4.9045 1.2351 2.1157 1.0751 1.0491 1.0964 1.0524 1.0520 2.2702 1.0488 6.0709 6.1129 12.4151 1.0827 1.0849 1.0357 1.0357 1.0615 1.0599 1.0970 1.0988 1.1011 1.1032 1.0993 1.1000 1.0879 1.0858 1.0908 1.0959 1.1014
irintensity: 0.1135 0.9053 2.8560 0.8869 1.2824 3.3953 8.7427 0.6395 0.7808 1.9245 1.1492 0.6088 1.5247 3.4344 2.4453 0.5578 0.5051 4.1816 1.8278 5.9821 0.1527 23.0098 1.3649 7.4617 56.2222 1.1742 42.9083 4.8711 5.3118 0.3718 6.6311 1.9392 2.3496 0.1553 1.2839 72.0790 0.5592 0.6546 1.8125 12.3105 74.2754 2.2140 8.0968 6.0773 56.3459 14.2885 20.1355 1.0261 0.3087 3.5646 11.8678 12.3694 1.6722 19.6618 21.3754 7.4094 4.7087 0.2952 1.1633 35.3525 1.7795 26.8781 11.9874 2.3364 6.3896 18.8119 2.4082 4.6771 10.8896 15.7052 1.0057 1.7848 22.2152 40.6773 27.9243 22.3908 20.4064 8.1288 19.0855 3.3547 33.6597 1.9129 23.1679 58.7632 35.6690 9.6981 0.4142 9.7123 33.6392 24.7497
temp: 298.150 k
press: 1.00000 atm
elementType: 8 7 6 6 6 6 6 6 6 6 6 6 6 6 6 1 1 1 1 1 1 1 1 1 1 1 1 1 1 1 1 1
symmnumber: 1
zpe: 701790.9 jmol-1
zpe.correction: 0.267298 hartree
zpe.thermalcorrener: 0.282331 hartree
zpe.thermalcorrenthalpy: 0.283276 hartree
zpe.thermalcorrgfe: 0.224005 hartree
zpe.sumelectzpe: -634.411193 hartree
zpe.sumelectthermal: -634.396160 hartree
zpe.sumelectthermalent: -634.395215 hartree
zpe.sumelectthermalfe: -634.454486 hartree
dipole: 4.5338 3.1476 1.9562
dipole: 5.8558
quadrupole: -108.5056 -96.2638 -84.5328
quadrupole: -17.1662 -6.0668 -2.5049
quadrupole: -12.0716 0.1702 11.9013 -17.1662 -6.0668 -2.5049
hfenergy: -634.678491 hartree
pointgroup: C01 [X(C13H17N1O1)]
dipole: -1.7302338 -1.1019565 1.048628 debye
polarizability: 171.1699685|-9.1836946|130.4025878|-4.7628291|2.1164235|130.7752773 unknown
InChI: InChI=1S/C13H17NO/c1-11(2)15-13(9-6-10-14)12-7-4-3-5-8-12/h3-5,7-8,11,13H,6,9H2,1-2H3
charge 0 multiplicity 1
32 atoms
O  0.622973 -1.334018 -0.359391
N  4.672746 2.050618 -1.166356
C  0.420191 -0.078488 0.387305
C  1.431118 0.918226 -0.221377
C  -1.012719 0.441054 0.278556
C  -0.110082 -2.51923 0.166554
C  2.888042 0.403151 -0.069454
C  -1.671647 0.983928 1.408173
C  -1.686857 0.420912 -0.969073
C  -0.100264 -3.5357 -0.98109
C  0.558671 -3.060577 1.444748
C  -2.978973 1.511232 1.294583
C  -2.99381 0.941253 -1.08423
C  -3.642958 1.492001 0.046882
C  3.87843 1.308852 -0.672357
H  0.669082 -0.228778 1.462655
H  1.194849 1.055455 -1.292003
H  1.314876 1.900011 0.271958
H  -1.154871 -2.214678 0.388424
H  2.959244 -0.593218 -0.541868
H  3.13577 0.272865 1.002598
H  -1.161927 0.995256 2.380472
H  -1.183519 -0.019863 -1.837553
H  -0.621396 -4.463472 -0.683438
H  -0.602166 -3.119372 -1.871194
H  0.938548 -3.790822 -1.257504
H  0.014533 -3.950301 1.811826
H  0.560489 -2.313616 2.259203
H  1.603531 -3.352944 1.23554
H  -3.478504 1.929638 2.175598
H  -3.50733 0.919803 -2.052122
H  -4.656868 1.89762 -0.043165
