program: Gaussian 09
title: 000097944
version: EM64L-G09RevD.01
frameworkgroup: C1[X(C4H6O4)]
method: RPBEPBE
basis: SDD
operation: Freq
keyword: #p
keyword: freq=noraman
keyword: PBEPBE/SDD
title: #p freq=noraman PBEPBE/SDD
converged: YES YES NO NO
title: Mulliken charges:
elementType: O O O O C C C C H H H H H H
charge: -0.261917 -0.224490 -0.428471 -0.177107 -0.080860 -0.321735 -0.321126 0.270734 0.273456 0.232311 0.247123 0.205906 0.224644 0.361532
chargesum: 0.00000
title: Mulliken charges with hydrogens summed into heavy atoms:
elementType: O O O O C C C C
charge: -0.261917 -0.224490 -0.066939 -0.177107 0.192596 0.157700 0.109424 0.270734
polarizability: 6.62247319e+01 7.09705795e+00 5.78382545e+01 -2.28541458e+00 -6.62839797e-02 3.79781905e+01
1716.lowfreq: -10.4065 -3.1353 -0.0008 0.0003 0.0008 10.4258 44.4043 98.3547 154.3454
frequency: 44.3297 98.3361 154.3381 214.2307 376.9514 408.5573 435.7463 507.0009 636.2587 664.3466 670.2313 774.8896 859.9697 914.4302 964.3476 977.8947 987.5132 1036.4230 1059.9320 1103.0019 1167.0457 1201.2316 1284.5575 1305.5398 1334.0966 1354.7325 1386.9117 1451.5679 1481.7167 1753.7440 2964.3388 3023.3313 3052.7949 3071.9977 3118.2169 3557.3717
redmass: 6.6770 3.7686 4.6777 2.7952 4.1754 3.5127 1.2628 4.0204 4.2654 10.0516 7.4801 7.3852 4.5754 1.5295 8.4900 5.5478 3.8590 4.0285 2.6373 2.0756 1.1122 1.2449 1.3379 1.2564 1.2414 1.2716 1.3030 1.0831 1.0845 12.9098 1.0668 1.0637 1.0863 1.0974 1.1045 1.0661
irintensity: 5.2933 10.7413 0.8214 0.4373 6.9375 19.7745 163.8084 2.5334 5.6377 14.5671 7.7578 1.4318 46.3241 45.7684 163.9548 238.0889 74.9264 54.0998 0.7455 7.8997 8.5609 12.6410 0.3460 13.8766 10.4108 5.4528 20.2317 4.1731 8.5474 531.9781 42.9892 31.2569 12.4702 25.0257 17.9022 14.9681
temp: 298.150 k
press: 1.00000 atm
elementType: 8 8 8 8 6 6 6 6 1 1 1 1 1 1
symmnumber: 1
zpe: 271539.9 jmol-1
zpe.correction: 0.103424 hartree
zpe.thermalcorrener: 0.111044 hartree
zpe.thermalcorrenthalpy: 0.111988 hartree
zpe.thermalcorrgfe: 0.070389 hartree
zpe.sumelectzpe: -456.266932 hartree
zpe.sumelectthermal: -456.259312 hartree
zpe.sumelectthermalent: -456.258368 hartree
zpe.sumelectthermalfe: -456.299967 hartree
dipole: 2.7912 3.4807 0.0465
dipole: 4.4619
quadrupole: -64.8399 -43.8615 -43.9313
quadrupole: -0.8137 2.2791 -0.6956
quadrupole: -13.9623 7.0161 6.9463 -0.8137 2.2791 -0.6956
hfenergy: -456.3703561 hartree
pointgroup: C01 [X(C4H6O4)]
dipole: -1.1297535 -1.3435058 0.0158931 debye
dipolederiv: -1.3994617 -0.0736512 -0.1543372 -0.0462328 -0.5182578 0.0276795 -0.1684563 0.0007607 -0.3188104 -0.5955082 -0.1344894 -0.0114102 -0.2247938 -1.1281461 0.033691 -0.0536951 0.0158708 -0.2778491 -0.4910747 0.2793391 0.0915522 0.3774541 -0.5584352 0.072425 0.0888694 0.0673078 -0.5533628 -0.996949 -0.3698622 -0.0855193 -0.4122996 -0.7651837 -0.0363348 -0.1168202 -0.0495119 -0.3333878 0.3767682 0.1752683 0.035038 0.3853327 0.2048054 0.0742657 0.0713489 0.0434479 0.2999946 0.3543633 0.2875731 -0.0591406 0.0850685 0.2973113 0.0050984 -0.0044655 0.0051022 0.3287055 0.3946251 -0.1917985 0.0496533 -0.2417026 0.5034724 -0.1090082 0.0236502 -0.0486665 0.3500517 2.048511 0.3484465 0.2809896 0.3730816 1.7447128 -0.0344493 0.3169479 0.0051544 0.3878456 0.0120526 -0.0181236 -0.0190698 -0.0665839 0.0389491 0.011965 -0.0444535 -0.0251035 -0.1001781 0.0109029 -0.0870881 0.0440095 -0.0431418 0.0478684 0.0281153 0.051155 0.1009757 -0.0862979 0.0598923 -0.0296104 0.0111096 -0.0238735 -0.0276567 -0.0678753 -0.0015961 -0.1196268 0.0216151 -0.0003208 0.0580438 -0.1091806 0.0512478 0.0248976 -0.0007231 -0.0604211 0.0352462 -0.1690899 -0.0021504 -0.0783724 -0.0110182 -0.047889 -0.0827056 0.002923 -0.0171771 -0.0294292 0.0964494 0.2283495 -0.165675 -0.0626763 -0.1656679 0.2183682 -0.007772 -0.0848865 -0.0015279 0.3543141 unknown
polarizability: 66.453785|6.9321942|57.5140346|2.7220713|-0.1284763|38.0733572 unknown
InChI: InChI=1S/C4H6O4/c5-1-3-2-7-4(6)8-3/h3,5H,1-2H2
charge 0 multiplicity 1
14 atoms
O  0.111282 0.808815 -0.181799
O  1.523224 -0.992295 0.128279
O  -2.830714 0.889774 -0.08926
O  2.392717 1.184598 0.223582
C  -0.746286 -0.399132 -0.410755
C  0.159202 -1.57561 0.043619
C  -2.029604 -0.223818 0.403756
C  1.446261 0.41753 0.07411
H  -0.975445 -0.421191 -1.490019
H  -0.110712 -1.954385 1.04569
H  0.192125 -2.400704 -0.682209
H  -1.767336 -0.104066 1.476939
H  -2.670356 -1.115632 0.28894
H  -2.294359 1.721018 -0.020274
