program: Gaussian 09
title: 000098042
version: EM64L-G09RevD.01
frameworkgroup: C1[X(C17H22O3)]
method: RPBEPBE
basis: SDD
operation: Freq
keyword: #pfreq=noraman
keyword: PBEPBE/SDD
title: #p freq=noraman PBEPBE/SDD
converged: YES YES NO NO
title: Mulliken charges:
elementType: O O O C C C C C C C C C C C C C C C C C H H H H H H H H H H H H H H H H H H H H H H
charge: -0.343583 -0.210112 -0.387903 0.327279 -0.442442 -0.461594 -0.767019 -0.053103 -0.306132 0.367617 0.219657 -0.591421 0.105878 -0.785166 -0.796242 0.177356 -0.303330 -0.395648 -0.250865 -0.195882 0.206897 0.223585 0.216038 0.228226 0.223501 0.211164 0.274204 0.234516 0.211571 0.211639 0.214456 0.214890 0.214528 0.227872 0.215104 0.234037 0.220154 0.271929 0.219004 0.232896 0.231306 0.355139
chargesum: 0.00000
title: Mulliken charges with hydrogens summed into heavy atoms:
elementType: O O O C C C C C C C C C C C C C C C C C
charge: -0.343583 -0.210112 -0.032764 0.327279 -0.011960 -0.017330 -0.058149 0.181413 -0.094562 0.367617 0.219657 -0.165327 0.105878 -0.127876 -0.126948 0.177356 -0.031401 -0.176644 -0.017969 0.035424
polarizability: 2.19450448e+02 8.33648290e+00 2.50952279e+02 1.98663465e+01 -1.26744828e+01 1.28602480e+02
1716.lowfreq: -10.5906 -5.7757 -1.8339 0.0004 0.0005 0.0007 10.8870 19.6964 31.3678
frequency: 10.4237 19.6139 30.9549 40.5944 54.3189 73.0861 75.5599 102.4714 114.9572 131.6837 139.1790 174.9658 189.9175 196.3101 220.0759 231.1864 251.0999 277.3510 286.8117 288.4933 309.9357 354.2873 381.0364 387.2761 394.9712 420.6575 423.6248 448.3540 455.5211 478.9017 521.0448 530.8996 550.2742 564.3757 642.9331 674.4482 684.8597 715.3054 743.5959 755.3817 767.1025 782.5627 795.8280 825.2200 843.9709 850.1672 856.9246 924.7541 930.5102 946.8156 954.6240 980.4301 982.9003 985.9367 995.3211 1004.1422 1013.9874 1036.0986 1041.7808 1050.6259 1082.0616 1085.6157 1099.1157 1128.6068 1155.1590 1161.0120 1174.2597 1178.8236 1203.9254 1229.6424 1241.2694 1252.5417 1274.6164 1292.7059 1294.0914 1296.6878 1340.7606 1359.5601 1379.9481 1388.3560 1393.8322 1399.4447 1421.0100 1428.8679 1441.8911 1455.7073 1461.5457 1470.7368 1473.1062 1473.8165 1481.1398 1483.0503 1488.4313 1593.0248 1606.8780 1629.8550 1655.6860 1695.1209 2955.8929 2962.8307 2972.3386 2986.0004 2996.6089 3026.6217 3030.5547 3041.9171 3056.3751 3073.3131 3079.3788 3086.3882 3092.5630 3095.4773 3110.6949 3112.6314 3120.7418 3142.1449 3161.7646 3183.4731 3201.4506 3550.9312
redmass: 5.0201 4.2034 2.7602 4.5283 3.3141 3.3403 4.3147 3.7284 3.4531 1.1106 3.0876 1.4847 1.9362 3.4315 1.2190 4.2443 2.7934 2.9793 3.1046 2.4503 2.5582 3.5271 2.4717 1.7826 2.0261 3.0133 2.8562 3.4799 3.2349 2.3657 3.3143 2.9088 6.3043 3.1053 4.2493 4.2616 2.5336 4.0433 1.6645 2.0724 2.0452 5.9270 2.2884 2.5129 2.8666 1.5042 1.8796 1.7470 1.3488 1.3874 1.3617 1.5373 1.9499 1.3361 1.2519 1.7046 2.4240 1.6862 2.2105 2.8264 1.6642 1.6801 1.8903 2.3586 1.3507 1.4670 1.0907 2.6274 2.1725 4.0028 2.0318 2.8741 1.4199 1.3632 1.3408 1.2626 1.4745 1.4416 1.2260 1.2971 7.0811 1.2419 1.1790 2.3428 1.0795 1.0502 1.0621 1.0618 1.0750 1.0475 1.0591 1.0887 2.5283 6.7539 6.6836 10.4710 4.7880 6.4607 1.0373 1.0387 1.0656 1.0581 1.0377 1.0970 1.0964 1.0968 1.0919 1.0973 1.0965 1.0980 1.0955 1.0624 1.0915 1.0887 1.1000 1.0893 1.0953 1.0968 1.1141 1.0658
irintensity: 0.0295 0.1542 0.0104 3.5813 0.4704 0.3365 1.1381 1.1097 1.4853 0.3358 1.2140 1.6567 0.5856 3.0413 0.4374 1.8371 1.3394 1.7889 3.1567 0.1964 3.4916 1.5773 29.0596 54.0160 43.4567 6.3402 3.0065 2.1957 14.3190 1.0941 14.0197 13.1934 5.1115 0.3998 12.1268 20.0779 5.7681 7.8216 4.0885 68.4362 22.7229 0.6841 3.4809 19.4736 54.8107 2.3121 19.8541 6.2884 67.9118 1.5609 3.1526 3.5610 4.7522 1.4527 6.3626 230.4886 202.5305 14.5225 5.8223 3.3604 7.9209 74.4379 100.0083 17.9857 93.9497 34.3813 9.5383 45.6914 4.0719 234.9422 8.8712 10.3569 5.7842 28.2441 28.7472 4.5952 1.8207 3.7968 32.4869 24.4696 12.4347 9.6475 23.8480 27.2001 3.8726 3.2749 3.9322 7.0563 12.3417 23.0717 9.6199 13.0426 20.2889 26.4191 31.9844 228.9443 5.1354 3.2085 43.7057 53.9731 12.7557 20.2169 32.2502 7.2855 49.5957 10.3914 9.1975 12.7846 60.3909 40.0194 45.9341 16.1434 4.3195 13.1998 9.2271 10.3194 18.3355 8.0409 20.2048 28.3700
temp: 298.150 k
press: 1.00000 atm
elementType: 8 8 8 6 6 6 6 6 6 6 6 6 6 6 6 6 6 6 6 6 1 1 1 1 1 1 1 1 1 1 1 1 1 1 1 1 1 1 1 1 1 1
symmnumber: 1
zpe: 906939.5 jmol-1
zpe.correction: 0.345435 hartree
zpe.thermalcorrener: 0.367544 hartree
zpe.thermalcorrenthalpy: 0.368488 hartree
zpe.thermalcorrgfe: 0.291436 hartree
zpe.sumelectzpe: -885.133008 hartree
zpe.sumelectthermal: -885.110899 hartree
zpe.sumelectthermalent: -885.109955 hartree
zpe.sumelectthermalfe: -885.187007 hartree
dipole: -0.3967 -2.9633 0.0552
dipole: 2.9903
quadrupole: -101.6413 -113.8111 -118.8040
quadrupole: 13.1506 7.3131 0.4965
quadrupole: 9.7775 -2.3923 -7.3852 13.1506 7.3131 0.4965
hfenergy: -885.4784427 hartree
pointgroup: C01 [X(C17H22O3)]
dipole: 0.1740638 1.1620657 0.0579731 debye
polarizability: 220.3646375|9.1211884|249.829364|-17.8468063|16.6244581|128.8112055 unknown
InChI: InChI=1S/C17H22O3/c1-5-17(4,12-8-9-13(2)3)20-16(19)14-10-6-7-11-15(14)18/h5-7,9-11,18H,1,8,12H2,2-4H3
charge 0 multiplicity 1
42 atoms
O  0.105564 -0.710778 0.388856
O  1.983305 -2.066033 0.034357
O  4.16654 -0.59969 -0.852689
C  -0.846582 -1.896327 0.457667
C  -2.226791 -1.191934 0.601629
C  -2.633559 -0.290049 -0.593876
C  -0.528357 -2.725662 1.715975
C  -0.756737 -2.674524 -0.848791
C  -3.956363 0.405034 -0.344517
C  -4.199995 1.745311 -0.255657
C  1.482535 -0.930288 0.193564
C  -0.98694 -4.000301 -0.998405
C  2.213993 0.375049 0.227316
C  -5.606295 2.265369 0.003751
C  -3.145179 2.828498 -0.405185
C  3.547857 0.506085 -0.266367
C  1.592494 1.525772 0.787128
C  4.220506 1.752776 -0.181012
C  2.260205 2.761878 0.875431
C  3.584243 2.872263 0.388485
H  -2.986937 -1.984514 0.745785
H  -2.204911 -0.58331 1.526151
H  -2.722017 -0.921726 -1.501393
H  -1.823857 0.43444 -0.785698
H  -0.512968 -2.068491 2.603226
H  -1.31069 -3.489364 1.874695
H  0.445312 -3.229673 1.618204
H  -0.538591 -2.059374 -1.733503
H  -4.81549 -0.273666 -0.213263
H  -0.947563 -4.470329 -1.986786
H  -1.196046 -4.662028 -0.150042
H  -5.9406 2.934317 -0.814613
H  -5.644403 2.864252 0.935949
H  -6.337674 1.443393 0.094229
H  -3.131176 3.482797 0.489461
H  -2.129018 2.427249 -0.549571
H  -3.378241 3.482392 -1.269397
H  0.570032 1.419077 1.157917
H  5.245482 1.840108 -0.565581
H  1.758882 3.627943 1.318426
H  4.119868 3.825893 0.449433
H  5.076962 -0.359836 -1.162785
