program: Gaussian 09
title: 000098000
version: EM64L-G09RevD.01
frameworkgroup: C1[X(C16H23NO4)]
method: RPBEPBE
basis: SDD
operation: Freq
keyword: #p
keyword: freq=noraman
keyword: PBEPBE/SDD
title: #p freq=noraman PBEPBE/SDD
converged: YES YES NO NO
title: Mulliken charges:
elementType: O O O O N C C C C C C C C C C C C C C C C H H H H H H H H H H H H H H H H H H H H H H H
charge: -0.439098 -0.217168 -0.213628 -0.178412 -0.352231 -0.020872 -0.473831 -0.072199 -0.526058 -0.538103 -0.603863 0.139310 0.138204 0.198631 -0.263931 -0.707782 -0.322788 0.355005 -0.828770 -0.183352 -0.581886 0.274195 0.212750 0.205786 0.265708 0.256641 0.240811 0.237843 0.283839 0.240218 0.245177 0.351932 0.222825 0.347227 0.233549 0.221764 0.233504 0.257539 0.228490 0.244152 0.223269 0.227384 0.217753 0.220464
chargesum: 0.00000
title: Mulliken charges with hydrogens summed into heavy atoms:
elementType: O O O O N C C C C C C C C C C C C C C C C
charge: -0.091871 -0.217168 -0.213628 -0.178412 -0.000299 0.253323 -0.055295 0.193510 -0.028606 -0.016421 -0.118468 0.139310 0.138204 0.198631 -0.041106 -0.018966 -0.065250 0.355005 -0.132859 0.044033 -0.143669
polarizability: 1.95072404e+02 -2.46567444e+00 2.43260396e+02 -5.31739609e+00 -8.85586786e+00 1.57265153e+02
1716.lowfreq: -7.2132 -2.2839 -0.0009 -0.0006 0.0002 6.4955 14.3399 19.4972 35.3545
frequency: 13.2790 19.4262 35.2984 43.3882 54.3600 62.3717 80.7642 85.1425 92.7170 134.4388 143.6654 153.2591 163.4647 166.6729 171.5572 181.1862 192.7907 234.9240 267.0166 285.3214 293.1259 303.4041 336.0704 348.9358 396.7171 417.2849 421.7325 423.2468 440.4182 466.8563 469.2036 508.4259 539.1363 544.0353 557.6251 589.1326 603.2566 637.9058 659.5598 683.1670 784.0224 797.7565 810.8044 822.9776 849.3746 865.7133 870.4231 909.2549 912.2155 915.2250 918.1758 933.0610 966.2290 973.2456 1000.0669 1005.6407 1025.3776 1040.4806 1053.1907 1054.2057 1064.2474 1066.7666 1101.8941 1109.7082 1125.5348 1134.9096 1148.4442 1160.6617 1182.0951 1222.7647 1238.4373 1254.7621 1259.2786 1268.4239 1274.6689 1287.6272 1291.0251 1297.4600 1314.9085 1316.2435 1328.6455 1335.2796 1359.6296 1365.5802 1367.8258 1372.7820 1378.0388 1390.3285 1401.8042 1427.5972 1432.4096 1438.9662 1445.9312 1453.0968 1465.3210 1468.8805 1469.6967 1476.5855 1609.4553 1626.8716 1639.0211 1641.4413 1642.1359 2952.0643 2971.3167 2973.2817 2978.1962 2984.1271 2988.2250 2996.3476 3000.5575 3018.2411 3039.4897 3051.8065 3059.1282 3072.0974 3082.3105 3087.3593 3092.5555 3096.3270 3097.3089 3100.9917 3106.6758 3207.7586 3482.8341 3513.6637
redmass: 6.2201 5.7032 4.0572 3.9618 7.2997 3.2796 5.7674 3.7227 2.7770 4.8229 6.6383 3.0091 1.8312 1.1142 2.0283 1.9196 3.5019 2.8252 1.4826 1.8694 3.3281 3.0991 4.2594 2.8926 2.9391 2.8884 2.7309 4.5217 2.9646 2.4793 2.6926 3.7190 3.0280 2.4866 4.3706 3.3925 3.1913 3.6803 3.4526 1.6193 3.2502 2.3694 1.5458 2.7612 3.3086 1.9781 1.8649 1.8459 2.2663 3.0318 1.5215 1.3319 2.0672 1.5850 2.5194 1.2365 2.1657 1.4824 2.4161 1.9484 1.8681 2.2949 2.5707 1.9489 2.5210 2.1295 1.2331 1.3629 1.3369 1.7679 1.6232 1.4153 1.5080 1.6250 1.7356 1.5290 1.3950 1.4268 1.5016 2.9550 1.4194 1.4929 1.5879 1.4498 1.1532 1.7522 1.3001 1.1934 1.4619 1.2359 1.0978 1.0867 1.0884 1.0887 1.0425 1.0476 1.0550 1.0944 5.4253 6.3533 11.4166 5.6108 5.3856 1.0589 1.0687 1.0674 1.0394 1.0738 1.0637 1.0359 1.0902 1.0900 1.0934 1.0967 1.0970 1.0934 1.0928 1.0847 1.0861 1.0975 1.0981 1.1001 1.0715 1.1143 1.0759 1.0664
irintensity: 0.0743 0.1529 0.5902 1.0459 4.0116 0.7906 4.1598 0.6662 0.4233 2.9310 7.8606 0.2252 2.9388 2.7571 4.1586 0.8269 1.6495 8.2897 149.0117 64.0145 1.3187 0.9109 17.1397 5.2210 23.3663 1.8793 5.5987 8.0726 4.7340 2.1021 1.2313 5.8884 3.9409 2.4908 17.5197 6.1274 7.8384 0.8514 1.6404 0.2370 9.5403 11.3427 110.0255 9.9669 0.4644 6.7036 12.5061 1.9431 6.0747 6.5577 9.2703 84.5678 4.5276 4.4912 7.9770 28.3540 11.0094 2.5973 54.0969 9.6094 68.3894 15.4426 3.4830 26.0491 12.3966 3.0331 47.0075 5.9757 6.8963 27.8849 65.9092 41.2650 6.9096 96.8974 120.7258 10.0859 34.6030 2.3403 49.8430 89.8905 10.9738 2.8653 11.2208 1.2463 20.0844 14.6424 3.9113 12.9134 26.9692 9.6635 6.5412 0.3883 6.4280 21.5410 10.0921 21.1484 4.8401 6.3925 14.4138 158.0336 139.8469 6.8676 485.8774 22.6292 12.8123 4.4397 17.3300 5.5829 23.1690 23.3142 4.8795 20.3556 2.9923 19.0627 44.9353 14.3089 4.9759 4.0510 8.2982 2.2645 49.8666 24.3072 3.1639 18.3944 36.1859 56.1949
temp: 298.150 k
press: 1.00000 atm
elementType: 8 8 8 8 7 6 6 6 6 6 6 6 6 6 6 6 6 6 6 6 6 1 1 1 1 1 1 1 1 1 1 1 1 1 1 1 1 1 1 1 1 1 1 1
symmnumber: 1
zpe: 953050.3 jmol-1
zpe.correction: 0.362998 hartree
zpe.thermalcorrener: 0.386220 hartree
zpe.thermalcorrenthalpy: 0.387164 hartree
zpe.thermalcorrgfe: 0.307534 hartree
zpe.sumelectzpe: -977.528186 hartree
zpe.sumelectthermal: -977.504964 hartree
zpe.sumelectthermalent: -977.504020 hartree
zpe.sumelectthermalfe: -977.583650 hartree
dipole: 5.3442 2.0888 -4.2879
dipole: 7.1631
quadrupole: -144.3065 -141.3551 -126.4597
quadrupole: 11.6185 1.1190 10.2204
quadrupole: -6.9327 -3.9814 10.9141 11.6185 1.1190 10.2204
hfenergy: -977.8911836 hartree
pointgroup: C01 [X(C16H23N1O4)]
dipole: 2.0903766 -0.8092007 1.7081337 debye
polarizability: 194.3713651|-3.4619852|243.944626|7.7997896|2.6725362|157.2819621 unknown
InChI: InChI=1S/C16H23NO4/c1-4-10(2)5-11(3)14(19)9-13(18)6-12-7-15(20)17-16(21)8-12/h4-5,11-13,17-18H,1,6-9H2,2-3H3
charge 0 multiplicity 1
44 atoms
O  0.491595 0.164785 -0.701232
O  -5.092203 -2.775816 0.216201
O  -4.730051 1.296606 -1.958123
O  1.927836 3.201242 0.58738
N  -4.831554 -0.731374 -0.844645
C  -2.244758 -0.384614 0.257635
C  -1.086856 -0.01111 1.212828
C  0.029753 0.818937 0.540813
C  -3.23734 -1.339466 0.960979
C  -3.000644 0.860342 -0.26399
C  1.21165 1.075155 1.510143
C  -4.443417 -1.702276 0.104817
C  -4.232636 0.525746 -1.096511
C  2.250286 2.028845 0.906674
C  3.688649 1.485263 0.705548
C  4.656743 2.605474 0.264128
C  3.642778 0.357844 -0.311432
C  3.862192 -0.987635 -0.117009
C  4.20517 -1.614919 1.222386
C  3.770417 -1.879015 -1.293014
C  3.941909 -3.232392 -1.292244
H  -1.79901 -0.90309 -0.613913
H  -0.642951 -0.943396 1.620754
H  -1.485388 0.56131 2.077047
H  -0.356409 1.796913 0.202967
H  -2.754642 -2.286578 1.25727
H  -3.618335 -0.87162 1.893425
H  -3.335179 1.489801 0.587779
H  -2.359029 1.494952 -0.89693
H  1.67271 0.11289 1.804349
H  0.81129 1.556251 2.424173
H  -5.657379 -0.958284 -1.413474
H  4.00933 1.083388 1.688302
H  1.222838 -0.47251 -0.487276
H  4.660303 3.430274 0.997723
H  5.681871 2.209436 0.161781
H  4.342792 3.031675 -0.70406
H  3.422062 0.69562 -1.335599
H  3.448474 -2.367073 1.517769
H  5.173935 -2.145459 1.161653
H  4.280118 -0.873368 2.033724
H  3.540754 -1.381666 -2.247449
H  3.853732 -3.813148 -2.216219
H  4.175294 -3.795541 -0.38163
