program: Gaussian 09
title: 000097935
version: EM64L-G09RevD.01
frameworkgroup: C1[X(C10H12Cl2O)]
method: RPBEPBE
basis: SDD
operation: Freq
keyword: #p
keyword: freq=noraman
keyword: PBEPBE/SDD
title: #p freq=noraman PBEPBE/SDD
converged: YES YES NO NO
title: Mulliken charges:
elementType: Cl Cl O C C C C C C C C C C H H H H H H H H H H H H
charge: -0.069888 -0.056980 -0.286252 -0.152047 -0.357991 0.493761 -0.601919 -0.360085 -0.440703 -0.212011 -0.209121 -0.107312 -0.513015 0.192719 0.244026 0.230319 0.287118 0.251387 0.267218 0.237154 0.255341 0.256262 0.201449 0.240283 0.210289
chargesum: 0.00000
title: Mulliken charges with hydrogens summed into heavy atoms:
elementType: Cl Cl O C C C C C C C C C C
charge: -0.069888 -0.056980 -0.286252 0.040671 0.116355 0.493761 -0.063414 -0.092868 -0.203550 0.043330 0.047141 -0.107312 0.139006
polarizability: 1.72993316e+02 1.49632954e+01 1.06900104e+02 2.09633710e+00 -7.68451205e+00 1.05593230e+02
1716.lowfreq: 0.0008 0.0016 0.0017 1.9617 3.7454 10.2130 31.6597 36.4205 56.7479
frequency: 31.6004 36.4180 56.6876 76.5784 92.1378 117.0978 146.0086 170.1656 215.5881 247.3258 261.7927 312.1474 327.5762 398.5814 408.8650 434.9493 491.2975 539.0847 624.6142 654.1968 672.0058 718.4016 765.2797 815.3533 827.3134 834.9167 898.6586 950.2893 968.2168 977.9437 1001.7485 1030.0565 1044.1249 1065.3632 1072.3784 1103.2960 1111.4899 1132.1340 1148.7736 1182.0468 1206.8195 1245.4292 1267.3649 1291.6000 1301.1036 1318.2302 1346.5492 1383.1846 1397.7552 1434.9491 1456.3760 1460.6773 1467.4458 1475.8055 1479.8407 1588.8492 1602.3671 2919.2436 2937.9082 3009.1332 3019.1959 3051.7016 3074.0807 3104.5489 3124.0927 3140.3623 3155.1562 3170.8730 3175.5670
redmass: 4.7527 7.2083 2.2679 2.6582 3.9643 2.7473 4.3337 2.4544 2.3293 6.9045 5.4453 5.4440 4.1168 4.4572 3.0452 5.6245 4.3662 2.8100 7.0357 3.8913 6.3080 3.3304 1.9871 1.6935 1.3877 1.3926 4.8796 1.3911 1.3790 2.3256 3.8233 2.0259 7.3835 3.6785 2.7193 1.3226 1.2867 1.2464 1.4353 1.1153 1.9786 1.1675 1.2637 1.2892 1.1593 1.4128 1.8021 5.3452 2.2849 1.1309 1.0864 1.0764 1.0960 1.2270 1.8651 7.4376 6.3132 1.0834 1.0344 1.0613 1.0999 1.0588 1.1023 1.0978 1.0900 1.1098 1.0885 1.0951 1.0973
irintensity: 0.0651 0.5804 4.8765 2.3691 0.7167 1.5146 1.7916 1.9237 3.8585 2.0201 1.0703 1.9088 2.7235 2.9151 0.0847 16.8551 3.4686 47.7026 1.4330 12.3890 54.6498 2.0351 1.1428 32.3716 28.3654 27.3823 5.9760 0.7652 0.4379 25.4196 40.7159 2.3742 136.5816 7.3226 36.3243 7.5996 2.7419 7.0707 8.3499 0.2919 0.8143 9.7789 2.4929 6.1407 2.8438 21.6431 29.6435 4.5746 11.6205 2.3808 7.6071 6.8453 0.5929 15.2520 68.1745 1.4070 15.5567 39.6938 85.5266 8.7206 67.1830 22.6497 15.5471 25.4882 12.0981 19.2078 1.7067 5.3423 0.8663
temp: 298.150 k
press: 1.00000 atm
elementType: 17 17 8 6 6 6 6 6 6 6 6 6 6 1 1 1 1 1 1 1 1 1 1 1 1
symmnumber: 1
zpe: 511814.6 jmol-1
zpe.correction: 0.194940 hartree
zpe.thermalcorrener: 0.208828 hartree
zpe.thermalcorrenthalpy: 0.209773 hartree
zpe.thermalcorrgfe: 0.151570 hartree
zpe.sumelectzpe: -1382.607359 hartree
zpe.sumelectthermal: -1382.593471 hartree
zpe.sumelectthermalent: -1382.592526 hartree
zpe.sumelectthermalfe: -1382.650729 hartree
dipole: 1.7277 2.0811 1.7226
dipole: 3.2068
quadrupole: -101.4038 -96.4883 -84.3675
quadrupole: 11.1948 3.4708 -2.4239
quadrupole: -7.3173 -2.4018 9.7191 11.1948 3.4708 -2.4239
hfenergy: -1382.802299 hartree
pointgroup: C01 [X(C10H12Cl2O1)]
dipole: -0.7621917 -0.6439792 0.7720873 debye
dipolederiv: -0.3797653 0.2580653 -0.09788 0.2201867 -0.5075184 0.1092548 -0.1420886 0.1838761 -0.2514492 -0.8780386 -0.1393122 0.0767589 -0.1651553 -0.1142332 -0.0075253 0.0924685 -0.0070068 -0.1242575 -0.7849073 -0.2808468 -0.0019462 -0.3535942 -0.9374824 0.1355857 0.0210106 0.0575644 -0.392946 0.558685 -0.0020712 0.0300633 0.3044517 0.7924107 -0.0872111 0.062632 -0.0853437 0.4179866 -0.1195063 0.1269889 -0.0880138 -0.0893733 -0.2645332 0.0403247 -0.1139083 0.1022152 -0.0224519 0.1249653 -0.0226147 0.0163309 0.0275892 -0.1267993 0.0115987 -0.0259587 0.00664 -0.0836395 0.4303647 -0.2567119 0.1206668 -0.3538534 0.568101 -0.1838301 0.1561701 -0.1487792 0.2961714 -0.038041 0.054115 0.0127871 0.0805643 -0.0463909 0.0902111 -0.046839 0.052302 0.0040613 -0.0124382 0.0314192 -0.0565477 0.0352147 -0.1064526 0.0792757 0.0258199 0.1009373 0.0222361 -0.3078685 -0.0719154 -0.0560082 -0.0902263 -0.0971247 0.0437216 -0.0474682 0.0459503 -0.0005351 -0.3241405 -0.0174596 0.0793533 0.008627 -0.0733355 0.05178 0.1031815 0.0538731 -0.0376064 1.2404272 0.2463508 -0.1336804 0.2659019 0.0208156 0.0499363 -0.1602962 0.0412333 0.0915034 0.5880297 0.3038964 -0.0348949 0.134163 0.359782 -0.0626765 -0.094697 -0.1674388 0.3535889 -0.0160492 0.0083966 0.0464111 -0.0191043 -0.0342886 -0.0232198 0.0393879 -0.0311946 -0.1863016 0.0897038 0.0027652 0.0565606 0.0232174 0.0450673 -0.0346067 0.0448696 -0.0254848 -0.0710509 -0.1724059 -0.0701732 0.0124615 -0.0106519 0.0707033 0.00363 -0.0032793 -0.0100316 0.0748533 -0.0911684 -0.0406934 -0.0117002 -0.0325698 0.0146681 0.0360423 0.0017292 0.0302868 0.0433285 0.0437768 0.0406039 -0.0122365 0.0489371 0.0233016 0.0378453 -0.0072262 -0.0171752 -0.1307574 0.0765457 -0.0447854 -0.0516103 -0.042492 0.1027588 -0.0685662 -0.063249 -0.0630267 0.0466721 0.0191926 0.0168675 0.1088645 0.0050421 0.1118505 -0.0594788 0.1021145 -0.0685057 -0.0106189 0.0495953 0.0106809 0.0696104 0.0044448 0.1298158 -0.0591804 0.0721122 -0.0589306 0.0220492 0.049738 -0.0521762 -0.0474021 -0.0561529 0.1125893 -0.0769588 -0.0447464 -0.0742977 0.0432266 -0.0161899 -0.0795022 0.0191634 0.0044375 0.075893 -0.0687477 0.1068923 0.0470083 -0.1992847 0.0587349 -0.0049851 0.0148124 -0.0573887 -0.1535391 -0.031109 0.0059966 -0.0463698 0.1002124 -0.1892397 -0.0169023 -0.0719243 0.1077848 0.0339407 0.0739044 -0.0846279 0.0816984 -0.0049907 unknown
polarizability: 175.0598344|8.9547507|107.4158665|-1.211394|7.7544574|103.0109484 unknown
InChI: InChI=1S/C10H12Cl2O/c1-13-10(6-7-11)8-2-4-9(12)5-3-8/h2-5,10H,6-7H2,1H3
charge 0 multiplicity 1
25 atoms
Cl -3.279457 2.944644 -0.969306
Cl 4.608485 0.594983 -0.259278
O  -1.613225 -1.992413 -0.022187
C  -1.397178 -0.603102 0.420851
C  -2.272536 0.373554 -0.424959
C  0.092179 -0.329115 0.272954
C  -2.086632 1.831042 -0.003133
C  0.783384 -0.767739 -0.884311
C  0.801598 0.384877 1.26796
C  2.157643 -0.492636 -1.052266
C  2.177122 0.675499 1.114176
C  2.832272 0.231867 -0.049395
C  -2.905345 -2.557819 0.370431
H  -1.688028 -0.508031 1.493002
H  -2.007099 0.251546 -1.490722
H  -3.337685 0.101036 -0.310115
H  -1.083931 2.219467 -0.229656
H  -2.334859 2.003949 1.056289
H  0.247452 -1.35089 -1.639264
H  0.289146 0.713713 2.180309
H  2.693874 -0.836733 -1.941384
H  2.724635 1.225916 1.884453
H  -3.080513 -2.443785 1.461197
H  -2.848481 -3.629183 0.121617
H  -3.752319 -2.103845 -0.182463
