program: Gaussian 09
title: 000097924
version: EM64L-G09RevD.01
frameworkgroup: C1[X(C6H13NO)]
method: RPBEPBE
basis: SDD
operation: Freq
keyword: #p
keyword: freq=noraman
keyword: PBEPBE/SDD
title: #p freq=noraman PBEPBE/SDD
converged: YES YES NO NO
title: Mulliken charges:
elementType: O N C C C C C C H H H H H H H H H H H H H
charge: -0.279399 -0.534696 0.040462 -0.406877 -0.420317 -0.372349 -0.305935 -0.464574 0.172957 0.198586 0.204736 0.193747 0.218688 0.210509 0.195993 0.216543 0.173878 0.219439 0.201609 0.254145 0.282856
chargesum: 0.00000
title: Mulliken charges with hydrogens summed into heavy atoms:
elementType: O N C C C C C C
charge: -0.279399 0.002305 0.213419 -0.003554 -0.007882 0.034152 0.084486 -0.043526
polarizability: 8.26447583e+01 -1.58964088e+00 7.29400651e+01 -1.31768046e+00 1.02139302e-01 6.26320287e+01
1716.lowfreq: -14.9759 -0.0011 -0.0008 -0.0005 13.7851 28.0966 92.8137 125.7377 194.1884
frequency: 92.6911 125.6579 194.1669 228.8145 274.0867 324.7176 356.6847 435.9714 451.2296 472.6013 550.0930 690.0725 744.7246 812.1967 842.5534 859.7482 895.3582 926.2861 964.6641 1017.6968 1035.3570 1059.9481 1075.7079 1100.7285 1124.7674 1162.2431 1173.6670 1193.6663 1251.8166 1253.8574 1280.9768 1314.8687 1335.0984 1337.4233 1342.2883 1346.7184 1356.0712 1365.2883 1440.3202 1449.0628 1455.2764 1458.1022 1469.4651 1647.5569 2889.8416 2923.6628 2967.6269 2975.8109 2985.1675 2991.4127 3033.1382 3039.7023 3050.5104 3054.2931 3069.0581 3439.0537 3563.3242
redmass: 2.9692 2.6523 2.2162 2.1188 1.1905 1.5978 3.8670 3.8470 2.0804 2.6299 1.7213 1.5545 2.6295 1.4819 2.5224 1.5876 1.9111 2.3876 1.6277 2.0333 1.9649 2.6042 2.2549 2.3243 2.5052 1.3684 1.5827 1.6263 1.2639 1.2400 1.2132 1.2294 1.3045 1.4473 1.3881 1.2392 1.4925 1.2684 1.0905 1.0899 1.0876 1.0883 1.0928 1.0859 1.0829 1.0690 1.0627 1.0605 1.0609 1.0602 1.0977 1.1017 1.1024 1.1029 1.0959 1.0447 1.0963
irintensity: 0.1274 1.2692 6.7082 3.6253 51.2651 20.3774 5.0121 4.3741 16.4294 3.4661 3.6952 307.2959 24.9099 0.2793 6.3917 17.9033 14.9635 5.0656 23.3100 46.6172 27.3788 12.9473 10.2236 8.2116 2.1199 1.4728 5.3522 6.7226 4.8107 5.7475 2.3386 5.6526 4.4124 2.0479 5.2003 4.6322 1.1004 0.4591 0.5876 9.8716 17.0173 3.7607 8.7059 31.6652 52.5523 82.5001 37.5137 21.3863 34.4487 53.9727 36.1400 28.6739 45.1715 87.2406 49.2460 1.8363 1.5733
temp: 298.150 k
press: 1.00000 atm
elementType: 8 7 6 6 6 6 6 6 1 1 1 1 1 1 1 1 1 1 1 1 1
symmnumber: 1
zpe: 492101.2 jmol-1
zpe.correction: 0.187431 hartree
zpe.thermalcorrener: 0.195884 hartree
zpe.thermalcorrenthalpy: 0.196829 hartree
zpe.thermalcorrgfe: 0.154760 hartree
zpe.sumelectzpe: -365.724772 hartree
zpe.sumelectthermal: -365.716319 hartree
zpe.sumelectthermalent: -365.715375 hartree
zpe.sumelectthermalfe: -365.757444 hartree
dipole: 2.4732 0.6054 1.6815
dipole: 3.0513
quadrupole: -56.4159 -48.2446 -48.7360
quadrupole: -0.9890 -3.9529 -0.9207
quadrupole: -5.2837 2.8876 2.3962 -0.9890 -3.9529 -0.9207
hfenergy: -365.9122039 hartree
pointgroup: C01 [X(C6H13N1O1)]
dipole: 0.977902 0.2582454 0.6466575 debye
dipolederiv: -0.8319534 0.2025946 0.0188331 0.2516989 -0.7132698 0.0249285 0.0345951 0.0030632 -0.4022262 -1.01627 -0.1299521 -0.0991185 -0.1371258 -0.3753533 0.0782362 -0.1889454 0.0730238 -0.2687347 0.1929671 -0.1200532 -0.0658269 -0.2213718 0.533987 0.0548875 -0.22934 0.0913323 0.3796907 -0.1217559 -0.081736 -0.0045916 0.024953 -0.0102928 0.0263932 0.0153467 0.0094557 0.1126945 0.0485899 0.0145572 -0.005688 -0.012851 0.0402841 -0.0164948 0.0359636 0.0071177 0.1568344 -0.0396074 -0.0253269 0.0349534 -0.0710205 -0.0355762 -0.0034017 0.0117124 0.02782 0.1101657 0.6513568 -0.1899636 0.0331249 -0.073377 0.3319561 -0.0480617 0.0829582 -0.1299787 0.3874387 0.4888769 0.1202963 -0.0127785 0.1452309 0.3086567 -0.0710744 -0.0338658 -0.0830229 0.2440638 0.0150782 0.0020676 -0.0207447 0.0393292 -0.0437035 0.0351496 0.0572416 -0.026792 -0.2533282 0.0341226 0.0813092 0.0278336 0.0834765 -0.1539912 -0.0685399 0.030691 -0.100797 0.0451905 0.035158 -0.0072229 -0.0223915 -0.0139641 0.0762728 -0.0010582 -0.0184622 0.0632463 -0.1633873 0.0517415 0.0286644 0.011236 0.0371036 0.0499325 0.0186785 -0.0476987 -0.0304107 -0.1993079 -0.1034205 -0.1281554 0.0401031 -0.126721 -0.0783946 0.0404999 0.0614586 0.0595541 0.060921 0.0881382 -0.0163226 -0.00832 -0.0233215 0.0301142 0.0160851 0.0525361 -0.0098217 -0.1726112 -0.1852493 0.0997292 -0.0560834 0.076187 0.0287783 0.0195233 -0.0865633 0.0300805 0.0627212 0.012055 0.0358768 -0.0010282 0.054321 -0.1624201 -0.0557388 0.0140531 -0.1008333 0.0542503 -0.0464763 0.0274522 0.0156028 -0.0075461 0.0561209 -0.0125608 -0.0565266 0.1106123 -0.2357183 0.0222189 -0.0373141 0.0524718 -0.0295553 0.0784977 0.0083922 0.0194806 0.0521934 -0.1574545 0.0088934 0.0383509 0.0150542 0.0464901 -0.1531859 -0.0483644 0.0211854 -0.0952814 0.0652702 0.3643189 -0.0367516 -0.046379 -0.0773018 0.1454161 0.0067514 0.1006675 0.0068927 -0.0421217 0.3312172 0.1219004 0.0937373 0.0353656 0.0461711 -0.0042306 0.1235122 0.0425458 0.215649 unknown
polarizability: 82.648576|-1.4822519|72.9020279|-1.5461794|-0.0173771|62.6662483 unknown
InChI: InChI=1S/C6H13NO/c7-5-6-3-1-2-4-8-6/h6H,1-5,7H2
charge 0 multiplicity 1
21 atoms
O  -0.169034 -1.013292 -0.266803
N  -2.988686 -0.437107 0.174751
C  -0.552792 0.310584 0.280653
C  0.463027 1.389197 -0.149428
C  1.899911 0.996946 0.272935
C  2.248697 -0.415857 -0.254389
C  1.17078 -1.426075 0.183106
C  -1.986845 0.563051 -0.235449
H  -0.562216 0.235064 1.395905
H  0.178331 2.362445 0.297146
H  0.415335 1.501557 -1.251124
H  1.970854 1.001734 1.38073
H  2.629343 1.740558 -0.09883
H  2.297709 -0.399253 -1.360478
H  3.238356 -0.743785 0.119864
H  1.330733 -2.420192 -0.267714
H  1.174787 -1.52877 1.29274
H  -1.949054 0.58619 -1.341399
H  -2.318764 1.564094 0.100572
H  -3.222894 -0.396151 1.173309
H  -2.705278 -1.385439 -0.097399
