program: Gaussian 09
title: 000097943
version: EM64L-G09RevD.01
frameworkgroup: C1[X(C18H20O3)]
method: RPBEPBE
basis: SDD
operation: Freq
keyword: #pfreq=noraman
keyword: PBEPBE/SDD
title: #p freq=noraman PBEPBE/SDD
converged: YES YES NO NO
title: Mulliken charges:
elementType: O O O C C C C C C C C C C C C C C C C C C H H H H H H H H H H H H H H H H H H H H
charge: -0.136211 -0.132949 -0.436059 -0.209975 -0.108104 0.257940 -0.195057 -0.469621 -0.485709 -0.596052 -0.498838 0.002418 0.274459 -0.754185 -0.576459 0.057683 0.291536 -0.375145 -0.527991 -0.436915 0.284146 0.275223 0.222588 0.220082 0.223087 0.227331 0.199323 0.227862 0.256108 0.264216 0.212003 0.222354 0.239842 0.232190 0.224389 0.228105 0.232162 0.229801 0.259288 0.220863 0.354269
chargesum: 0.00000
title: Mulliken charges with hydrogens summed into heavy atoms:
elementType: O O O C C C C C C C C C C C C C C C C C C
charge: -0.136211 -0.132949 -0.081790 0.065248 0.114483 0.257940 0.025025 -0.019204 -0.058523 -0.075727 -0.064481 0.002418 0.274459 -0.057764 -0.116191 0.057683 0.291536 -0.145344 -0.268703 -0.216052 0.284146
polarizability: 2.37588907e+02 -1.05461952e+01 1.87048834e+02 2.09111588e+01 9.09987894e+00 1.42233728e+02
1716.lowfreq: -6.5991 -0.0009 -0.0004 0.0004 1.9953 13.0667 34.9637 49.9194 63.1165
frequency: 34.9026 49.8888 63.1059 82.7593 92.3280 143.3076 198.0210 213.7253 218.8785 253.7862 270.1006 276.1084 298.9257 310.9728 322.5701 334.6727 347.2785 350.4879 373.8954 391.3606 426.4588 440.0229 453.3921 467.4875 480.2982 517.3321 539.3378 558.3003 573.1838 609.7718 639.5310 649.1585 681.4557 696.3890 704.6449 720.0595 766.8735 803.4727 822.5029 830.8971 847.3522 875.4138 884.5878 893.1872 919.2933 932.0752 939.9436 968.5824 972.9196 984.0954 999.5963 1006.1332 1014.1687 1038.3481 1057.3193 1087.9924 1091.9356 1108.6494 1116.6875 1130.9366 1139.0179 1156.3072 1163.5203 1176.6961 1188.0312 1194.3236 1196.7934 1230.3294 1243.6066 1256.4452 1258.0407 1269.9304 1275.4785 1286.9330 1294.6627 1309.5829 1321.8611 1334.6545 1345.1000 1350.2023 1359.1128 1370.9545 1383.3690 1383.8090 1433.1571 1442.8610 1451.0869 1463.8443 1470.3517 1472.7156 1479.8827 1486.4319 1498.4722 1586.0507 1631.7598 1642.0232 1667.8507 2928.9552 2940.7910 2962.2960 2979.3540 2984.7954 2988.3142 2989.6813 2996.5398 3020.7506 3030.6418 3038.9590 3041.3625 3048.6113 3069.9300 3077.7211 3085.3795 3113.8243 3141.8515 3147.7133 3583.2373
redmass: 5.8279 6.5269 6.3644 5.1272 4.8564 4.6828 2.7868 1.9085 1.3950 4.2393 2.8661 2.4578 2.4558 8.9907 4.2490 3.1346 3.2414 1.1283 4.0531 2.7980 3.5945 2.8160 4.2586 3.8194 3.3421 4.1525 4.4025 2.8422 4.0215 4.6168 3.5442 2.9653 3.6438 3.8306 4.1426 3.9829 2.6558 1.6440 2.0675 2.4691 2.1757 2.5236 1.6086 2.8795 2.3076 1.7167 1.9611 2.8775 1.8083 2.1713 1.8165 2.3641 1.9148 3.4276 1.8674 2.6607 1.9366 1.8181 1.4384 2.3449 1.4558 1.3373 1.4720 1.3262 1.8060 1.4829 1.7866 1.9459 1.9220 1.5190 1.7519 1.9546 1.5980 1.5920 1.3881 1.6182 1.4719 1.5152 1.4825 1.4877 1.4176 1.3840 3.4720 1.3717 1.0830 3.0909 1.0942 1.1452 1.0535 1.0945 1.0614 1.2399 2.0146 7.1122 6.4145 12.1483 12.3342 1.0811 1.0824 1.0659 1.0346 1.0633 1.0588 1.0669 1.0651 1.0922 1.0858 1.1019 1.0963 1.1023 1.0952 1.0993 1.1005 1.0885 1.0917 1.0940 1.0660
irintensity: 0.9887 1.5924 1.8211 0.7219 4.7625 0.4999 1.9378 4.8778 0.2402 2.2515 3.3312 0.3440 1.4161 4.9419 7.5403 0.8866 6.7619 134.9062 4.0910 0.6252 1.8633 5.0457 0.6139 2.3173 1.3619 0.6687 2.2020 5.3786 2.6188 7.1105 1.6526 6.6812 6.8952 0.9945 1.0672 0.3427 5.0930 29.5576 6.5494 3.5248 4.5953 15.8608 21.6025 35.5707 5.9823 1.0940 3.6490 25.6488 21.7829 12.7149 11.4726 2.0887 7.7139 4.0187 7.8104 38.1778 14.8998 36.6716 1.4800 5.1054 48.0057 81.4173 25.6239 29.3461 6.5037 10.3113 2.5877 7.7339 16.9191 8.2700 0.5077 45.3858 3.5955 1.2664 4.6675 2.4915 1.3863 4.9037 1.1886 4.5198 2.9105 10.4359 20.6828 5.1748 23.7012 4.9585 10.1091 5.4295 11.6746 14.4148 14.3119 54.6976 56.7279 27.1737 58.5447 196.0601 39.0646 29.7383 33.1133 20.9843 18.1932 40.4745 35.9576 36.3785 19.2374 34.5215 22.5951 50.2025 33.2803 37.6903 13.3017 28.4283 17.6007 17.7406 12.3739 11.3427 40.1346
temp: 298.150 k
press: 1.00000 atm
elementType: 8 8 8 6 6 6 6 6 6 6 6 6 6 6 6 6 6 6 6 6 6 1 1 1 1 1 1 1 1 1 1 1 1 1 1 1 1 1 1 1 1
symmnumber: 1
zpe: 886808.6 jmol-1
zpe.correction: 0.337768 hartree
zpe.thermalcorrener: 0.355721 hartree
zpe.thermalcorrenthalpy: 0.356665 hartree
zpe.thermalcorrgfe: 0.292681 hartree
zpe.sumelectzpe: -922.042063 hartree
zpe.sumelectthermal: -922.024110 hartree
zpe.sumelectthermalent: -922.023165 hartree
zpe.sumelectthermalfe: -922.087150 hartree
dipole: 4.9200 -0.2071 1.1977
dipole: 5.0679
quadrupole: -154.0292 -117.8954 -120.8723
quadrupole: -12.6184 -7.6091 -1.1523
quadrupole: -23.0969 13.0369 10.0600 -12.6184 -7.6091 -1.1523
hfenergy: -922.3798307 hartree
pointgroup: C01 [X(C18H20O3)]
dipole: 1.9313525 -0.1025415 0.484583 debye
polarizability: 237.1166483|-11.3221987|186.8608775|21.5157094|9.6590446|142.8939428 unknown
InChI: InChI=1S/C18H20O3/c1-18-7-6-13-12-5-3-11(19)8-10(12)2-4-14(13)15(18)9-16(20)17(18)21/h3,5,8,13-15,19H,2,4,6-7,9H2,1H3
charge 0 multiplicity 1
41 atoms
O  -3.892158 -1.643914 -0.451585
O  -4.790996 1.183769 -0.03748
O  5.487701 -0.167535 1.142202
C  -1.227987 0.608686 0.535803
C  -0.642347 0.942158 -0.872704
C  -1.784834 -0.859499 0.650051
C  0.294093 -0.166775 -1.431014
C  -0.92968 -1.940459 -0.050207
C  -0.470186 -1.514623 -1.45801
C  -2.469026 1.510965 0.823486
C  0.120327 2.290536 -0.888366
C  -3.196551 -0.738838 0.060491
C  1.648758 -0.196088 -0.701348
C  -1.966625 -1.252895 2.153336
C  1.350655 2.261319 0.043751
C  -3.654878 0.743993 0.244481
C  2.158272 0.967957 -0.048652
C  2.465096 -1.355273 -0.725881
C  3.437513 0.937192 0.553647
C  3.740836 -1.390276 -0.127104
C  4.226406 -0.229257 0.518775
H  -0.445025 0.750583 1.301641
H  -1.49757 1.020106 -1.581106
H  0.503184 0.11023 -2.488121
H  -1.527655 -2.869786 -0.110523
H  -0.044727 -2.155295 0.579336
H  0.140648 -2.316201 -1.91205
H  -1.35335 -1.397531 -2.117269
H  -2.407512 2.522151 0.386697
H  -2.634815 1.648043 1.910688
H  -0.538338 3.133261 -0.604437
H  0.448869 2.48427 -1.928459
H  -2.393306 -2.2687 2.230416
H  -0.978854 -1.247238 2.649324
H  -2.630803 -0.56362 2.705331
H  1.028216 2.404234 1.095834
H  2.007944 3.122855 -0.181666
H  2.105524 -2.259366 -1.228385
H  3.839024 1.825085 1.054432
H  4.345816 -2.305386 -0.166942
H  5.96424 -1.030035 1.055287
