program: Gaussian 09
title: 000097884
version: EM64L-G09RevD.01
frameworkgroup: C1[X(C10H12O3)]
method: RPBEPBE
basis: SDD
operation: Freq
keyword: #pfreq=noraman
keyword: PBEPBE/SDD
title: #p freq=noraman PBEPBE/SDD
converged: NO YES NO NO
title: Mulliken charges:
elementType: O O O C C C C C C C C C C H H H H H H H H H H H H
charge: -0.280969 -0.197933 -0.261554 -0.382068 -0.230978 -0.679124 0.395600 -0.270514 0.231529 -0.338283 -0.370390 -0.292881 -0.170294 0.215175 0.215172 0.221268 0.221341 0.212682 0.225175 0.212668 0.267321 0.250241 0.260024 0.280615 0.266173
chargesum: 0.00000
title: Mulliken charges with hydrogens summed into heavy atoms:
elementType: O O O C C C C C C C C C C
charge: -0.280969 -0.197933 -0.261554 0.048280 0.211631 -0.028598 0.395600 -0.003193 0.231529 -0.088042 -0.110366 -0.012265 0.095880
polarizability: 2.20748042e+02 -1.78810063e-01 1.09617517e+02 3.33248841e-02 2.09259045e-02 6.27515407e+01
1716.lowfreq: -28.0273 -3.8226 -1.9953 -0.0009 -0.0007 -0.0005 21.1679 41.6594 51.4601
frequency: -3.7271 40.2135 51.4408 62.9471 97.7538 130.7872 144.6306 211.1439 223.8240 231.2079 246.9135 311.4351 344.3911 403.5567 515.9690 582.1836 622.2185 649.3369 695.6826 729.5099 753.9072 755.9581 784.9418 844.2653 864.5450 875.6666 885.9660 888.0592 914.6441 965.0723 979.3515 985.5550 1001.9443 1051.2005 1058.7825 1123.1745 1136.0014 1139.9376 1141.8737 1203.7797 1224.9200 1253.2807 1276.4790 1293.6101 1299.7894 1310.2063 1369.2442 1391.7250 1394.7045 1469.8155 1477.3019 1478.7357 1489.3338 1491.8419 1553.5487 1605.2472 1659.3164 2980.3927 2994.9061 3004.7917 3043.0688 3062.7924 3084.8825 3085.6419 3112.6362 3160.5836 3227.9719 3254.6670 3273.9341
redmass: 2.5254 2.2858 4.8025 4.8458 4.5248 4.4121 3.3619 1.0977 6.3153 2.9997 4.3223 4.7521 3.2962 4.2418 4.3648 3.7182 2.7424 7.4413 3.8170 1.3584 1.0766 5.7519 1.5472 6.1377 1.3891 1.1545 2.6911 1.9520 3.0100 2.8221 4.2683 5.2966 1.1529 2.8195 2.4558 2.5664 2.1637 2.1019 1.4638 1.2752 1.2673 1.4270 1.1014 1.3977 1.5846 1.6713 1.5869 4.2524 1.2123 1.0741 1.0586 1.0412 1.1190 4.0528 5.7151 11.7996 6.3013 1.0361 1.0580 1.0589 1.1021 1.1044 1.0990 1.1043 1.0906 1.0917 1.0930 1.0988 1.1087
irintensity: 0.0875 0.6538 0.2746 0.1551 0.0740 1.4252 2.4139 0.1049 0.5964 2.5233 2.6515 18.6360 2.5594 1.3756 1.0669 18.2821 13.3206 18.1534 0.1553 13.6666 7.4947 29.5846 91.9917 26.7089 4.6127 2.0325 11.7629 13.4194 3.6436 36.9446 1.5725 125.0351 49.3013 11.1776 31.7093 498.8652 14.0426 54.7995 0.3189 47.8118 0.3827 56.9190 0.0422 56.8698 25.4238 87.0642 1.6879 2.3185 13.3935 2.3904 2.0800 13.2255 17.8791 1.7334 8.6426 249.1637 209.3722 34.1273 11.2497 37.8779 1.5972 0.2571 43.5370 96.0349 1.0604 8.9585 1.4696 0.9025 0.2096
temp: 298.150 k
press: 1.00000 atm
elementType: 8 8 8 6 6 6 6 6 6 6 6 6 6 1 1 1 1 1 1 1 1 1 1 1 1
symmnumber: 1
zpe: 520226.9 jmol-1
zpe.correction: 0.198144 hartree
zpe.thermalcorrener: 0.210648 hartree
zpe.thermalcorrenthalpy: 0.211592 hartree
zpe.thermalcorrgfe: 0.157729 hartree
zpe.sumelectzpe: -612.927261 hartree
zpe.sumelectthermal: -612.914756 hartree
zpe.sumelectthermalent: -612.913812 hartree
zpe.sumelectthermalfe: -612.967676 hartree
dipole: 0.0169 -2.1609 -0.0009
dipole: 2.1610
quadrupole: -65.1653 -75.1523 -79.0767
quadrupole: 0.2351 -0.0020 -0.0014
quadrupole: 7.9661 -2.0209 -5.9452 0.2351 -0.0020 -0.0014
hfenergy: -613.1254046 hartree
pointgroup: C01 [X(C10H12O3)]
dipole: -0.0122688 0.8501131 -0.0011799 debye
dipolederiv: -1.9505406 -0.3884801 0.0002079 -0.6459004 -0.634991 0.00062 -0.0005068 0.0001308 -0.2829744 -1.0429249 -0.0457971 0.0003806 0.4548094 -0.3607688 0.0002315 -0.0001076 0.0003377 -0.1313683 -0.8508702 0.127838 -0.0001014 0.1904227 -0.9511334 0.000315 -0.0003805 0.0018571 -0.3258971 -0.0461995 -0.0241238 -0.00007 0.0461 0.073724 0.0000142 -0.0002442 0.0000742 0.1471877 1.0756431 0.0987175 0.0000914 -0.0326964 0.2086998 0.0002362 0.0007873 0.0004331 0.3616149 -0.0490979 0.004303 -0.0001123 -0.0909441 0.0386973 0.0000423 -0.0000766 0.0000339 0.0985732 -0.5546072 0.0363993 0.0001165 -0.1304252 0.0354296 -0.0000597 0.0003555 -0.0000678 0.008705 1.0521083 -0.1032586 -0.0003019 0.1090974 0.1080126 -0.0002012 -0.0000848 -0.0001832 -0.0723209 2.5058563 0.1147621 -0.0003466 0.1572632 1.2381954 -0.0009258 -0.0006032 -0.0020807 0.2420359 -1.3332155 0.1242673 -0.0000553 -0.1205002 0.0356876 -0.0002841 0.0007592 -0.0003695 -0.215134 -0.0627375 -0.0200008 -0.0000113 -0.0816519 -0.0006444 -0.0002786 0.0000599 -0.0002471 -0.1949348 0.9032175 -0.047078 -0.0003076 0.0037696 0.0196703 -0.0001683 -0.0007141 -0.0002039 -0.1338294 -0.0157662 0.155839 -0.0003344 -0.0816916 0.220752 -0.0005501 0.0000441 -0.0005923 -0.1355605 0.0462137 0.0386798 -0.0462924 0.0050487 -0.0087237 0.10142 -0.0405907 0.1243063 -0.0703393 0.0460544 0.0389644 0.0463941 0.0053176 -0.0091722 -0.1015383 0.0408055 -0.1243663 -0.0697429 -0.0866676 -0.0138515 0.0062801 0.0544423 0.0023285 -0.0852601 0.0338324 -0.0948113 -0.0662452 -0.0864566 -0.0141 -0.0060824 0.0541126 0.0027618 0.0851121 -0.0339446 0.0945316 -0.0666005 0.0662802 0.0252544 0.0143249 0.0789007 0.0096825 -0.1221706 0.0630156 -0.1226417 -0.083931 -0.097057 -0.1206318 -0.0000968 -0.1604568 -0.0633041 -0.0000939 -0.0001226 -0.0000662 0.1051615 0.0665451 0.0249813 -0.0140399 0.0785951 0.0098537 0.1222386 -0.0627386 0.1226229 -0.0842744 0.0855233 0.0057728 0.000047 0.0284862 -0.0284292 0.000211 0.0000165 0.0002239 0.1551149 0.0875569 0.0214234 0.0000548 0.060563 -0.0620031 0.0003398 0.0002464 0.0002887 0.1749476 0.0929118 -0.0861846 0.0001758 -0.0422593 0.0309444 0.000255 0.0001057 0.0002705 0.1925206 0.0998985 -0.0080589 0.0000728 0.0249205 0.0281005 0.0002592 0.0000435 0.0002986 0.2214896 0.0483315 0.054363 0.0000063 0.0346769 0.0566298 0.0002361 0.0000428 0.0002208 0.2258019 unknown
polarizability: 220.7455607|0.555077|109.6199149|-0.0229078|-0.0674415|62.7516244 unknown
InChI: InChI=1S/C10H12O3/c1-2-6-13-10(11)4-3-9-5-7-12-8-9/h3-5,7-8H,2,6H2,1H3
charge 0 multiplicity 1
25 atoms
O  2.294111 0.349351 -0.001457
O  -4.849149 -0.062676 0.001457
O  1.483735 -1.847072 0.002756
C  4.634592 1.003469 0.000397
C  3.682754 -0.193596 0.0007
C  6.110089 0.545338 0.002124
C  -2.554434 -0.131451 0.000495
C  -1.205406 -0.671926 0.000687
C  1.264535 -0.606293 -0.000896
C  -0.049321 0.062141 -0.000959
C  -2.986122 1.264652 -0.001395
C  -3.723459 -0.891687 0.00202
C  -4.362714 1.265715 -0.000746
H  4.429786 1.627604 -0.889228
H  4.428226 1.629381 0.888405
H  3.813586 -0.832154 -0.893116
H  3.811636 -0.830261 0.896136
H  6.342528 -0.064504 -0.890803
H  6.790914 1.414583 0.002562
H  6.340618 -0.063887 0.895972
H  -1.098976 -1.765937 0.002004
H  -0.044512 1.156364 -0.002454
H  -2.343155 2.142433 -0.002958
H  -3.920297 -1.960381 0.003607
H  -5.124565 2.039294 -0.001509
