program: Gaussian 09
title: 000097868
version: EM64L-G09RevD.01
frameworkgroup: C1[X(C12H22O6)]
method: RPBEPBE
basis: SDD
operation: Freq
keyword: #pfreq=noraman
keyword: PBEPBE/SDD
title: #p freq=noraman PBEPBE/SDD
converged: YES YES NO NO
title: Mulliken charges:
elementType: O O O O O O C C C C C C C C C C C C H H H H H H H H H H H H H H H H H H H H H H
charge: -0.262897 -0.262952 -0.454811 -0.454772 -0.245234 -0.245093 -0.083620 -0.084117 -0.242720 -0.242657 -0.187918 -0.188020 -0.681734 -0.697702 -0.681590 -0.697284 0.242899 0.242875 0.215699 0.215656 0.229967 0.227995 0.229776 0.228548 0.259063 0.258850 0.235018 0.206381 0.213637 0.211276 0.215958 0.224600 0.234614 0.206391 0.213660 0.211257 0.215902 0.224614 0.374224 0.374259
chargesum: 0.00000
title: Mulliken charges with hydrogens summed into heavy atoms:
elementType: O O O O O O C C C C C C C C C C C C
charge: -0.262897 -0.262952 -0.080587 -0.080513 -0.245234 -0.245093 0.132079 0.131540 0.215242 0.215668 0.071145 0.070830 -0.026698 -0.045868 -0.026925 -0.045511 0.242899 0.242875
polarizability: 1.87936515e+02 -1.25023729e-01 1.42781459e+02 2.50796470e+00 -3.61249376e-02 1.28513851e+02
1716.lowfreq: -5.9566 -0.0011 -0.0009 -0.0006 2.2616 4.3662 10.6835 20.4433 26.2268
frequency: 10.4516 20.2257 26.0513 35.7927 46.8616 69.2358 75.8390 81.5347 92.3647 120.8437 147.3709 182.0724 187.0249 200.5141 206.5031 221.5902 225.0327 234.4834 243.5308 245.4115 259.9156 293.1474 322.7960 329.7890 348.7508 383.9199 392.9021 415.2278 415.2778 443.4229 487.4114 512.9432 556.1895 576.2465 674.0358 750.2992 792.1548 822.3539 828.8244 848.1822 871.9333 876.9582 891.0721 905.0414 916.6907 923.5456 925.3993 954.8574 959.4779 966.2458 968.1595 984.2089 1028.4768 1050.6992 1135.5365 1135.7240 1151.1922 1151.3749 1160.7215 1187.1804 1189.9844 1190.3046 1211.6829 1231.1580 1231.6334 1249.5443 1262.7866 1294.5346 1295.3237 1314.0049 1340.0006 1340.3865 1360.3334 1362.6036 1372.4052 1379.8026 1380.3836 1387.4929 1399.6427 1400.0096 1461.0716 1461.3941 1469.1922 1469.5049 1474.4118 1474.7032 1482.5056 1483.1612 1489.1129 1489.4405 1625.5490 1625.7587 2974.4972 2974.7412 2979.0797 2979.6507 2990.1116 2990.4200 3002.7522 3003.4709 3032.4104 3044.0169 3065.4235 3065.6186 3069.7532 3069.9121 3078.8146 3078.9173 3081.1839 3081.2939 3089.9286 3090.2883 3465.7449 3468.4666
redmass: 3.8877 3.8615 3.3484 2.9727 3.4204 7.4401 4.1854 5.7538 4.3025 4.4749 3.9022 2.7886 2.1276 1.2210 1.2706 4.8338 2.2742 1.8266 1.4032 1.6852 3.0944 1.7177 6.0033 3.3199 2.2401 2.5224 2.6742 1.9794 1.9619 1.1926 4.5305 4.2906 8.7182 5.6915 5.4915 7.3090 5.8069 2.8619 3.2823 3.9590 4.3358 2.9107 1.8762 1.5701 1.8045 1.2429 1.4082 1.6775 1.6308 1.6947 1.8366 3.0411 5.0255 4.6672 2.0501 2.0309 1.7447 1.7426 1.9133 2.7838 1.7501 1.7474 1.8373 1.2609 1.2649 1.6467 1.3067 1.3441 1.3433 1.4007 1.4161 1.4173 1.3376 1.4681 1.4107 1.2139 1.2122 1.4970 1.2264 1.2282 1.0703 1.0697 1.0442 1.0443 1.0650 1.0650 1.0504 1.0495 1.0588 1.0580 10.2718 10.2456 1.0358 1.0358 1.0372 1.0370 1.0826 1.0825 1.0578 1.0576 1.0833 1.0853 1.1008 1.1013 1.1026 1.1028 1.1032 1.1037 1.0993 1.0994 1.0995 1.0994 1.0651 1.0648
irintensity: 0.3000 0.3814 0.3259 0.8023 0.1888 0.0151 2.0088 7.0190 0.2508 3.8269 1.0892 0.1107 1.4575 0.3008 0.8085 2.5436 3.5448 0.5174 2.8155 0.2438 64.7285 80.2345 35.1081 2.1692 105.9497 6.1465 0.2156 6.9901 5.2683 24.1369 6.0562 0.0030 18.5176 27.9744 11.7671 2.4198 2.4659 1.2008 20.2741 1.3376 43.2432 2.0617 6.5956 5.7852 1.0795 4.5138 36.5893 7.0734 26.6720 3.4452 31.5800 11.5890 208.7836 168.2060 5.7494 3.5642 0.9387 0.5923 201.8705 149.2357 11.6756 11.6946 512.1161 4.7255 4.0345 81.2665 0.9214 2.1462 1.0102 6.0855 2.2390 1.6687 16.3334 5.4578 7.1798 22.0132 23.0874 37.5275 19.8091 14.0929 4.0612 3.6247 1.0518 0.5914 8.6019 8.0311 13.0560 12.6414 12.5023 38.3979 130.7445 238.6645 36.3594 27.1583 20.9057 21.3704 10.9095 10.2166 23.6211 20.9890 2.3720 28.1622 12.2386 10.7367 13.4249 13.8163 50.3390 56.4505 9.3031 107.9899 52.1469 32.1334 73.1069 23.2539
temp: 298.150 k
press: 1.00000 atm
elementType: 8 8 8 8 8 8 6 6 6 6 6 6 6 6 6 6 6 6 1 1 1 1 1 1 1 1 1 1 1 1 1 1 1 1 1 1 1 1 1 1
symmnumber: 1
zpe: 868173.9 jmol-1
zpe.correction: 0.330670 hartree
zpe.thermalcorrener: 0.353095 hartree
zpe.thermalcorrenthalpy: 0.354039 hartree
zpe.thermalcorrgfe: 0.275535 hartree
zpe.sumelectzpe: -920.358046 hartree
zpe.sumelectthermal: -920.335621 hartree
zpe.sumelectthermalent: -920.334677 hartree
zpe.sumelectthermalfe: -920.413181 hartree
dipole: -0.0057 -4.1461 -0.0200
dipole: 4.1461
quadrupole: -88.4736 -112.5826 -114.1860
quadrupole: -0.0187 -0.3784 -0.0004
quadrupole: 16.6071 -7.5019 -9.1053 -0.0187 -0.3784 -0.0004
hfenergy: -920.688716 hartree
pointgroup: C01 [X(C12H22O6)]
dipole: 0.0008058 -1.6292234 0.0803373 debye
polarizability: 188.0187937|0.0280314|142.735898|1.1889945|-0.8050328|128.4771341 unknown
InChI: InChI=1S/C12H22O6/c1-7(2)5-17-11(15)9(13)10(14)12(16)18-6-8(3)4/h7-10,13-14H,5-6H2,1-4H3
charge 0 multiplicity 1
40 atoms
O  2.334325 -0.354057 0.401772
O  -2.333653 -0.400763 -0.484969
O  -0.470062 1.822074 1.286835
O  0.466566 1.68218 -1.582615
O  2.250366 1.781469 1.343428
O  -2.254743 1.633846 -1.628543
C  4.340572 -1.60502 -0.239112
C  -4.338341 -1.598141 0.25797
C  3.833785 -0.337969 0.46024
C  -3.833638 -0.386491 -0.534609
C  0.169184 0.676882 0.668634
C  -0.170296 0.602071 -0.854986
C  3.969462 -1.6129 -1.739036
C  5.871758 -1.709936 -0.033414
C  -3.950032 -1.50308 1.750547
C  -5.872323 -1.707632 0.077349
C  1.688343 0.773868 0.851032
C  -1.690104 0.678959 -1.042833
H  3.858511 -2.474652 0.251275
H  -3.866698 -2.50298 -0.175573
H  4.185484 0.583569 -0.03987
H  4.128387 -0.300576 1.525203
H  -4.179432 0.569954 -0.10016
H  -4.136286 -0.425767 -1.597224
H  -0.207253 -0.241936 1.153102
H  0.206133 -0.359487 -1.248168
H  2.87945 -1.513163 -1.880912
H  4.460586 -0.774243 -2.268907
H  4.296665 -2.554226 -2.216668
H  6.392673 -0.840256 -0.477821
H  6.140418 -1.758544 1.038439
H  6.263417 -2.619427 -0.522664
H  -2.857668 -1.403195 1.873341
H  -4.428366 -0.624585 2.224529
H  -4.279335 -2.40508 2.297617
H  -6.38339 -0.807855 0.470312
H  -6.153824 -1.82425 -0.985923
H  -6.262412 -2.581202 0.629319
H  0.233912 2.512435 1.436058
H  -0.238844 2.353007 -1.799095
