program: Gaussian 09
title: 000097824
version: EM64L-G09RevD.01
frameworkgroup: C1[X(C8H17NO2)]
method: RPBEPBE
basis: SDD
operation: Freq
keyword: #p
keyword: freq=noraman
keyword: PBEPBE/SDD
title: #p freq=noraman PBEPBE/SDD
converged: YES YES NO NO
title: Mulliken charges:
elementType: O O N C C C C C C C C H H H H H H H H H H H H H H H H H
charge: -0.459891 -0.450999 -0.098013 -0.363427 -0.369092 -0.390634 -0.388008 -0.399399 -0.357993 -0.076573 -0.371426 0.206746 0.176574 0.172894 0.213161 0.199889 0.193644 0.193295 0.201343 0.191017 0.214680 0.206768 0.219239 0.185466 0.227756 0.225595 0.356525 0.340863
chargesum: 0.00000
title: Mulliken charges with hydrogens summed into heavy atoms:
elementType: O O N C C C C C C C C
charge: -0.103366 -0.110137 -0.098013 0.019894 0.016963 0.002899 0.006629 0.006298 0.068014 0.108892 0.081925
polarizability: 1.15956796e+02 -1.86305587e+00 8.86957934e+01 1.17279426e+00 2.27089206e+00 9.10211380e+01
1716.lowfreq: -3.9416 -0.0005 -0.0002 0.0004 6.4649 24.3754 40.4699 54.1060 75.2691
frequency: 39.0720 54.0734 75.2249 122.7505 176.8058 236.1102 241.5754 287.6649 304.8193 312.6085 343.3146 386.4586 431.2783 449.7657 468.4941 524.7334 544.7452 574.1980 761.3763 804.2850 833.5951 853.3330 856.6559 877.7955 909.1204 958.3332 963.9977 992.6403 1025.8768 1037.7953 1052.3344 1078.7179 1087.5464 1109.4585 1119.6409 1139.9257 1151.0830 1158.7589 1212.1586 1255.1895 1257.8391 1264.9843 1273.2923 1292.1038 1295.7521 1316.9523 1331.0266 1339.3402 1341.2003 1349.2458 1352.8899 1363.5525 1387.3787 1403.4303 1452.0401 1452.7445 1459.7250 1462.6441 1467.3584 1472.4470 1480.6824 2825.2755 2835.2259 2905.5728 2912.3565 2967.2864 2983.4698 2984.1962 3009.3811 3023.7121 3028.4806 3034.9897 3035.8516 3044.3648 3053.5179 3092.0648 3501.6676 3561.3968
redmass: 3.3324 3.9527 3.1163 3.2841 3.3772 2.8316 2.0897 3.2466 3.4415 1.1251 2.2309 1.7841 2.3572 2.8035 2.3542 1.1047 3.4538 2.0063 3.6351 1.4822 2.4352 2.2826 1.6454 2.0200 2.2206 1.4790 2.9839 2.5259 1.6627 2.2720 2.0258 1.5161 2.2134 2.0175 2.2686 1.2510 1.4745 2.1846 1.6106 1.2086 1.2816 1.2596 1.2755 1.3446 1.3276 1.2743 1.2978 1.3353 1.4232 1.4397 1.3666 1.3367 1.4017 1.6587 1.0912 1.0816 1.0878 1.0826 1.0899 1.0831 1.0978 1.0717 1.0699 1.0700 1.0816 1.0623 1.0616 1.0614 1.0595 1.0878 1.0907 1.0926 1.0919 1.1032 1.1038 1.1058 1.0649 1.0662
irintensity: 2.5503 0.7226 3.0454 5.7361 1.7547 5.6288 2.8202 10.2228 0.1153 95.3208 2.0691 3.7625 2.0239 0.6295 3.9811 183.8018 20.7778 3.2118 11.1758 0.1616 13.0815 1.6905 2.5546 19.8469 12.7902 15.7934 84.6366 24.2088 29.8648 50.0963 13.2515 29.1609 14.2585 13.9328 9.6070 10.6207 6.3405 20.1721 0.9093 23.8530 13.3807 1.3942 20.8128 11.7278 28.9626 2.2542 1.7690 18.5935 0.4613 5.4018 1.5195 0.7277 11.2984 13.7070 8.7310 3.6982 14.4685 6.7378 8.0412 6.1011 10.6235 44.4358 149.7270 96.1069 48.6378 37.6799 30.5898 30.9801 28.5725 43.3934 61.4455 58.2969 26.7967 21.3183 101.7833 26.8925 18.0364 6.2131
temp: 298.150 k
press: 1.00000 atm
elementType: 8 8 7 6 6 6 6 6 6 6 6 1 1 1 1 1 1 1 1 1 1 1 1 1 1 1 1 1
symmnumber: 1
zpe: 648547.9 jmol-1
zpe.correction: 0.247019 hartree
zpe.thermalcorrener: 0.258995 hartree
zpe.thermalcorrenthalpy: 0.259939 hartree
zpe.thermalcorrgfe: 0.208548 hartree
zpe.sumelectzpe: -519.298191 hartree
zpe.sumelectthermal: -519.286215 hartree
zpe.sumelectthermalent: -519.285271 hartree
zpe.sumelectthermalfe: -519.336662 hartree
dipole: -2.3467 1.4778 0.7536
dipole: 2.8738
quadrupole: -74.8334 -70.9237 -65.8309
quadrupole: 4.5966 3.5456 4.1928
quadrupole: -4.3041 -0.3944 4.6984 4.5966 3.5456 4.1928
hfenergy: -519.5452103 hartree
pointgroup: C01 [X(C8H17N1O2)]
dipole: -0.8918066 -0.693807 0.0405648 debye
polarizability: 115.9536078|2.0186682|91.763901|-0.4936323|1.8695143|87.956219 unknown
InChI: InChI=1S/C8H17NO2/c10-7-8(11)6-9-4-2-1-3-5-9/h8,10-11H,1-7H2
charge 0 multiplicity 1
28 atoms
O  3.036681 1.005123 -0.876712
O  3.568271 -0.901687 1.161748
N  -0.555351 0.302467 -0.0799
C  -1.082584 -0.465605 -1.238498
C  -1.618795 1.138154 0.536653
C  -2.237608 -1.393506 -0.811152
C  -2.790295 0.263279 1.026618
C  -3.365623 -0.583282 -0.132092
C  0.667017 1.074356 -0.418326
C  1.934681 0.207825 -0.322196
C  2.264887 -0.194456 1.123265
H  -0.260431 -1.061068 -1.676501
H  -1.446365 0.229832 -2.041602
H  -2.011504 1.898898 -0.189535
H  -1.177292 1.691548 1.386291
H  -1.845369 -2.148901 -0.102588
H  -2.623346 -1.932837 -1.697709
H  -3.574675 0.910097 1.464793
H  -2.421328 -0.407206 1.827176
H  -3.834591 0.089639 -0.880148
H  -4.160758 -1.258142 0.237363
H  0.772434 1.916492 0.291614
H  0.627483 1.518165 -1.441073
H  1.804477 -0.719614 -0.927691
H  1.448275 -0.803159 1.554795
H  2.429352 0.705012 1.740525
H  3.877194 0.595988 -0.535288
H  3.446362 -1.82191 0.814972
