program: Gaussian 09
title: 000097841
version: EM64L-G09RevD.01
frameworkgroup: C1[X(C14H18O2)]
method: RPBEPBE
basis: SDD
operation: Freq
keyword: #pfreq=noraman
keyword: PBEPBE/SDD
title: #p freq=noraman PBEPBE/SDD
converged: YES YES NO NO
title: Mulliken charges:
elementType: O O C C C C C C C C C C C C C C H H H H H H H H H H H H H H H H H H
charge: -0.276759 -0.259276 -0.343212 -0.383391 -0.352291 -0.278350 -0.692514 0.226529 0.476174 -0.357781 -0.253478 -0.366330 -0.383453 -0.236076 -0.232836 -0.232920 0.188886 0.189552 0.207984 0.209034 0.196990 0.196480 0.223116 0.226255 0.210381 0.210590 0.217497 0.248037 0.258890 0.231217 0.236857 0.229781 0.231404 0.233013
chargesum: 0.00000
title: Mulliken charges with hydrogens summed into heavy atoms:
elementType: O O C C C C C C C C C C C C C C
charge: -0.276759 -0.259276 0.035225 0.033627 0.041179 0.171022 -0.054047 0.226529 0.476174 -0.109743 0.005412 -0.135113 -0.146596 -0.006296 -0.001432 0.000093
polarizability: 2.98561981e+02 -1.13576456e+01 1.50968637e+02 -2.16088194e+00 -1.52393851e+00 8.57495461e+01
1716.lowfreq: -3.8604 -3.3281 -0.0008 -0.0005 0.0004 7.8914 18.0347 34.5012 36.7918
frequency: 17.9080 34.4774 36.6182 47.2674 77.1647 92.7952 92.8779 110.3357 137.1346 181.7937 186.5261 223.4840 230.6546 251.8594 282.3045 310.6739 390.8875 402.9660 444.7066 491.3166 517.6639 568.9122 615.1984 672.3166 698.7908 706.4293 729.7284 762.2391 775.4772 823.0803 842.1354 848.7590 882.2725 891.1673 917.7492 929.1526 963.6198 970.1322 980.8240 988.9802 997.8325 1016.4965 1021.3772 1026.0886 1069.9049 1077.8560 1083.8717 1124.3792 1127.6620 1149.1846 1174.3577 1191.7272 1202.1028 1217.6617 1251.0182 1255.5444 1280.5484 1291.4588 1297.8872 1302.3711 1318.1567 1336.6488 1354.2540 1373.1480 1387.6811 1390.2245 1440.5664 1466.5138 1466.8956 1474.5587 1477.5779 1483.0567 1485.5321 1490.3917 1582.3317 1601.8811 1613.7881 1646.9781 2957.1258 2969.7089 2973.1834 2988.4630 2996.9063 2997.0531 3023.6779 3042.2888 3068.2429 3072.4056 3073.0848 3099.2869 3124.2917 3129.7801 3141.7571 3152.5864 3159.6301 3167.7783
redmass: 4.2271 4.7583 1.9852 3.3753 4.3828 2.7429 3.3082 2.3319 2.5009 4.1821 5.1367 2.9313 1.1275 6.9304 3.1568 3.9807 4.0314 2.7601 3.2853 2.8297 4.4767 6.5825 6.4242 4.7903 1.6732 7.2123 1.0686 1.1075 1.9577 5.3479 1.1829 1.2782 2.5188 1.8076 3.3570 1.4700 1.1827 5.2439 1.3887 6.2017 1.3143 1.1994 3.6725 2.2418 2.4294 2.5348 1.6000 3.1853 2.6457 1.4839 1.0668 1.1287 1.4335 1.6211 1.2868 1.2299 1.0924 1.0923 2.0083 1.4589 1.4447 1.2729 1.5687 1.6187 6.2319 1.2325 2.2824 1.0811 1.0680 1.0684 1.0435 1.0867 2.2393 1.0946 5.7047 9.1705 6.9267 5.7319 1.0587 1.0589 1.0366 1.0597 1.0659 1.0890 1.1026 1.1042 1.1033 1.1047 1.0995 1.0899 1.0864 1.0869 1.0916 1.0964 1.0914 1.1015
irintensity: 0.0543 0.3298 0.0092 1.3769 0.0565 0.0612 0.1195 0.8088 0.3429 1.8540 0.5450 3.1706 0.0624 7.0305 1.5969 2.8466 9.8555 0.0298 6.3732 13.4366 1.2129 17.0505 0.1095 5.8297 43.1638 5.5210 11.1654 0.3010 66.2581 9.0259 0.9093 0.3214 11.9706 11.1087 6.7221 0.0386 3.6394 82.5635 0.2381 6.2315 4.9188 43.6108 22.6768 2.0583 78.8957 11.9930 10.2426 441.0504 150.9033 2.7433 3.4594 14.2881 0.6059 35.1312 2.0839 0.0969 0.3414 0.6901 57.5816 80.7465 22.2827 20.4415 0.4975 0.9668 16.6342 10.4437 16.6952 0.0675 0.3672 4.6931 12.4711 0.2579 18.0058 23.4622 9.2343 224.5581 58.4629 159.9849 7.0997 53.8922 37.2328 11.5475 40.4301 12.5467 16.7167 7.1374 4.4139 146.4275 57.3759 2.1256 5.0853 0.3638 11.0739 32.6044 9.4156 28.9212
temp: 298.150 k
press: 1.00000 atm
elementType: 8 8 6 6 6 6 6 6 6 6 6 6 6 6 6 6 1 1 1 1 1 1 1 1 1 1 1 1 1 1 1 1 1 1
symmnumber: 1
zpe: 746560.4 jmol-1
zpe.correction: 0.284350 hartree
zpe.thermalcorrener: 0.301265 hartree
zpe.thermalcorrenthalpy: 0.302209 hartree
zpe.thermalcorrgfe: 0.236532 hartree
zpe.sumelectzpe: -693.533129 hartree
zpe.sumelectthermal: -693.516214 hartree
zpe.sumelectthermalent: -693.515270 hartree
zpe.sumelectthermalfe: -693.580947 hartree
dipole: 0.7738 -2.0029 -0.0055
dipole: 2.1472
quadrupole: -70.5464 -96.4738 -99.5808
quadrupole: -0.4718 -0.3254 -0.4631
quadrupole: 18.3206 -7.6068 -10.7138 -0.4718 -0.3254 -0.4631
hfenergy: -693.8174786 hartree
pointgroup: C01 [X(C14H18O2)]
dipole: 0.3074627 -0.7867467 -0.0118066 debye
polarizability: 298.6322307|-10.7649998|150.9091011|-2.9030429|-0.7768998|85.7388319 unknown
InChI: InChI=1S/C14H18O2/c1-2-3-7-12-16-14(15)11-10-13-8-5-4-6-9-13/h4-6,8-11H,2-3,7,12H2,1H3
charge 0 multiplicity 1
34 atoms
O  -1.634475 -0.033871 0.093564
O  -0.667451 2.097535 0.074211
C  -5.461651 0.035968 0.069712
C  -4.016088 -0.513119 0.03011
C  -6.526632 -1.078491 -0.04578
C  -2.980481 0.607804 0.115748
C  -7.970747 -0.534771 -0.000025
C  -0.538772 0.844921 0.075316
C  3.265954 0.117472 0.013129
C  0.72335 0.07945 0.058501
C  1.928988 0.725876 0.030129
C  3.482366 -1.291799 0.047669
C  4.403497 0.974057 -0.038661
C  4.78759 -1.818897 0.030472
C  5.711216 0.446153 -0.056821
C  5.90877 -0.953513 -0.022203
H  -5.607254 0.76504 -0.754725
H  -5.622258 0.597039 1.013848
H  -3.856068 -1.084108 -0.90485
H  -3.859112 -1.218521 0.868945
H  -6.368304 -1.635611 -0.991442
H  -6.378827 -1.810022 0.774681
H  -3.073938 1.192944 1.050254
H  -3.050537 1.311089 -0.735236
H  -8.16153 0.004607 0.947005
H  -8.155542 0.171999 -0.830967
H  -8.712407 -1.35063 -0.079347
H  0.626961 -1.010568 0.0691
H  1.890278 1.825507 0.017697
H  2.626861 -1.974726 0.090151
H  4.251633 2.060108 -0.06511
H  4.937361 -2.903878 0.058666
H  6.572707 1.121528 -0.097328
H  6.922941 -1.367671 -0.035514
