program: Gaussian 09
title: 000097833
version: EM64L-G09RevD.01
frameworkgroup: C1[X(C7H12O6)]
method: RPBEPBE
basis: SDD
operation: Freq
keyword: #pfreq=noraman
keyword: PBEPBE/SDD
title: #p freq=noraman PBEPBE/SDD
converged: NO YES NO NO
title: Mulliken charges:
elementType: O O O O O O C C C C C C C H H H H H H H H H H H H
charge: -0.295320 -0.490522 -0.468210 -0.430897 -0.480195 -0.461991 0.384803 -0.217460 -0.277709 -0.449388 -0.168790 -0.160486 -0.160056 0.263350 0.259627 0.242376 0.234269 0.246713 0.274666 0.276718 0.375474 0.389081 0.375131 0.377059 0.361757
chargesum: 0.00000
title: Mulliken charges with hydrogens summed into heavy atoms:
elementType: O O O O O O C C C C C C C
charge: -0.295320 -0.115048 -0.079130 -0.055766 -0.103136 -0.100234 0.384803 0.045890 -0.018082 0.027257 0.077923 0.114180 0.116662
polarizability: 9.71532936e+01 2.44218006e+00 8.87816757e+01 -2.14725936e+00 -4.73383589e-01 8.27272290e+01
1716.lowfreq: -16.6592 -0.0011 -0.0007 0.0004 8.1048 12.8624 69.5054 102.9922 143.8646
frequency: 69.4728 102.9777 143.8609 201.4698 220.5929 237.8893 244.5978 264.4233 276.6320 300.8425 323.5615 339.4013 349.5510 383.8319 401.2110 457.2340 468.6208 513.8991 514.6532 550.8617 588.0119 646.0588 697.9084 786.5404 815.2811 825.2877 860.3547 883.5399 930.4263 940.2262 951.7130 966.7854 981.3388 1001.9769 1017.4253 1048.6477 1056.6313 1124.3460 1129.1000 1134.6537 1200.5388 1214.4461 1241.1985 1244.5927 1256.5761 1270.8007 1275.5847 1295.6452 1319.7001 1341.6478 1359.6951 1387.3333 1395.1051 1405.6780 1432.0029 1454.8785 1478.6186 3007.4277 3011.7412 3024.7288 3035.9119 3043.5472 3078.9854 3189.6867 3212.9495 3379.5288 3390.8766 3515.4104 3570.1236
redmass: 3.9744 5.2811 3.3698 6.0758 8.0782 3.1068 3.0599 4.9772 5.0770 3.7339 2.3676 1.7413 3.4289 5.2710 3.2151 4.4578 1.2198 5.2337 4.4146 5.7159 4.8894 1.1542 4.5718 4.2597 1.3460 3.3566 1.7761 5.4160 4.8071 2.9208 2.1325 5.5762 5.4020 6.8982 3.6813 1.9507 1.3395 1.2846 1.2077 2.3515 1.2192 1.2246 1.1954 1.3450 1.2126 1.3015 1.3925 1.9536 1.3971 1.5879 1.4798 1.5443 1.1840 1.4086 1.6446 1.3372 1.2463 1.0862 1.0857 1.0872 1.0867 1.0881 1.0538 1.1190 1.0682 1.0661 1.0662 1.0665 1.0660
irintensity: 40.2708 15.8968 0.0533 4.7945 2.0829 50.3388 18.7170 25.0004 21.2588 70.0945 51.0421 106.5763 2.0362 4.4369 1.2644 4.9584 156.6099 2.9387 2.1600 1.3713 7.0159 217.6183 2.9458 17.2731 103.2256 0.9474 5.8461 41.2543 44.9000 25.8446 12.5981 105.2039 8.8096 129.0542 43.1474 2.8461 0.4412 6.6839 1.1329 81.2026 17.5470 4.0291 12.0490 27.7536 0.1054 30.6390 5.8233 4.0374 10.4361 6.8443 4.8745 7.5717 39.5301 30.2775 74.2715 91.5220 3.8029 26.8233 42.3706 38.4136 24.6696 20.0102 15.4491 5.5682 199.1388 103.0577 119.0748 28.0238 16.9248
temp: 298.150 k
press: 1.00000 atm
elementType: 8 8 8 8 8 8 6 6 6 6 6 6 6 1 1 1 1 1 1 1 1 1 1 1 1
symmnumber: 1
zpe: 513119.0 jmol-1
zpe.correction: 0.195437 hartree
zpe.thermalcorrener: 0.208113 hartree
zpe.thermalcorrenthalpy: 0.209057 hartree
zpe.thermalcorrgfe: 0.158025 hartree
zpe.sumelectzpe: -724.165309 hartree
zpe.sumelectthermal: -724.152633 hartree
zpe.sumelectthermalent: -724.151689 hartree
zpe.sumelectthermalfe: -724.202721 hartree
dipole: 2.9408 -1.8754 -0.3366
dipole: 3.5041
quadrupole: -78.5465 -85.1388 -75.0663
quadrupole: -0.8135 -1.9497 -8.2195
quadrupole: 1.0374 -5.5550 4.5176 -0.8135 -1.9497 -8.2195
hfenergy: -724.3607461 hartree
pointgroup: C01 [X(C7H12O6)]
dipole: -1.2352386 0.5781858 -0.2011362 debye
dipolederiv: -0.3360816 0.010985 0.0275408 -0.0376763 -0.6307522 -0.0787802 0.0443767 -0.0673098 -0.381314 -0.4138521 0.0592703 0.1638865 -0.0038004 -0.7813841 -0.0537897 0.1406385 -0.1551763 -0.6121847 -0.6521507 0.0824144 -0.076778 -0.0484178 -0.7503465 -0.109989 -0.0641687 -0.0298662 -0.5374881 -0.5816308 0.0605154 0.0592734 0.0700859 -0.7520378 -0.0018987 0.0448941 0.0257318 -0.3819639 -0.3950952 -0.0465768 0.1123269 -0.0795502 -0.7355078 -0.0515806 0.097449 -0.1604504 -0.6445291 -0.5366262 -0.1306048 0.115218 -0.0892881 -0.7366011 0.0459463 0.0592414 0.0044619 -0.5017528 0.1229925 -0.0532709 -0.0232596 0.143032 0.1804432 0.0161689 -0.0089927 -0.0312759 0.2257408 0.188575 0.0626015 -0.0119638 0.0287316 0.5429085 0.1043471 0.0619502 0.1418017 0.2778434 0.2575359 -0.0350249 0.0515947 0.043922 0.4601861 0.1171607 -0.009721 0.1086863 0.2503395 0.1409064 -0.0117555 -0.0038627 -0.1187681 0.185549 -0.0170022 -0.0247729 -0.0294619 0.2212937 0.2945057 -0.060943 0.02451 -0.138616 0.4319443 -0.0096794 -0.0132899 0.0977193 0.1841427 0.2628575 0.1275213 -0.0526504 0.0921489 0.4161307 0.0296486 -0.0424751 0.0802005 0.2810325 0.2372132 0.0342867 -0.0607649 0.1229354 0.4803383 -0.076741 -0.0574883 -0.0613208 0.2288316 -0.0226897 -0.0482679 0.0845258 -0.0398444 -0.0216049 0.0374161 0.0687082 0.0290909 -0.0332103 -0.0118927 -0.0196679 -0.1094292 -0.0172244 0.0089563 -0.0388026 -0.0773211 -0.0390972 -0.0953427 0.0102339 0.0353576 0.0612354 0.0407072 0.0895879 0.026199 0.1022777 0.0015731 -0.0246843 0.0317023 0.045402 -0.0300823 0.0716195 0.0690736 0.0348339 -0.0761852 0.0616272 -0.0453711 0.005234 -0.0160169 -0.0636121 -0.0080151 -0.007008 -0.0783637 -0.0609008 -0.0776026 -0.1033154 -0.0272601 -0.0427054 0.0756129 -0.0338868 -0.0100452 0.0509956 0.0876133 0.0496211 -0.0794023 -0.0784937 0.0775101 0.0107785 0.0655008 -0.0218824 0.0102132 0.005092 0.0016016 0.0563101 0.2185325 -0.0446151 -0.1854918 -0.0153203 0.3018895 0.0543116 -0.1516591 0.0502273 0.2639418 0.2929516 -0.0723251 0.0088237 -0.0205137 0.340952 -0.0389955 0.0191398 -0.0401432 0.4933323 0.3348051 -0.0358853 -0.0237736 -0.0333448 0.3402753 -0.0414766 -0.0063606 -0.0516623 0.3437621 0.2134843 -0.0398065 -0.1400656 -0.0123402 0.3033745 0.0735565 -0.1505484 0.0947232 0.3364618 0.4442429 0.0616018 -0.013593 0.0179234 0.295561 -0.0036982 0.0125027 -0.0036994 0.2775264 unknown
polarizability: 95.5945194|3.0511474|89.3504646|3.8675728|1.9256242|83.7172142 unknown
InChI: InChI=1S/C7H12O6/c8-2-3(9)5(11)7(1-13-7)6(12)4(2)10/h2-6,8-12H,1H2
charge 0 multiplicity 1
25 atoms
O  -1.957411 -1.337861 -0.498409
O  -0.745368 1.567534 1.511375
O  -0.271836 2.023285 -1.100015
O  0.803475 -1.8721 1.335138
O  0.72113 -1.611811 -1.46123
O  2.118515 1.445355 0.175641
C  -1.31245 -0.010142 -0.162925
C  -0.659833 0.103251 1.212777
C  -0.465375 0.568586 -1.294625
C  -2.796014 -0.089899 -0.305642
C  0.81144 -0.413763 1.233291
C  0.913451 -0.146594 -1.312884
C  1.671072 0.056108 0.022526
H  -1.23299 -0.471793 1.962832
H  -0.978227 0.425996 -2.265162
H  -3.419293 -0.105776 0.594974
H  -3.268296 0.290277 -1.219093
H  1.301216 -0.050905 2.15743
H  1.522521 0.233373 -2.153978
H  2.578938 -0.572606 0.011494
H  -0.037511 1.81192 2.159918
H  -0.583395 2.23022 -0.16092
H  0.731318 -2.223373 0.400757
H  -0.191609 -1.806143 -1.802965
H  1.515932 2.018361 -0.381705
