program: Gaussian 09
title: 000097807
version: EM64L-G09RevD.01
frameworkgroup: C1[X(C10H12O4)]
method: RPBEPBE
basis: SDD
operation: Freq
keyword: #pfreq=noraman
keyword: PBEPBE/SDD
title: #p freq=noraman PBEPBE/SDD
converged: YES YES NO NO
title: Mulliken charges:
elementType: O O O O C C C C C C C C C C H H H H H H H H H H H H
charge: -0.267956 -0.266323 -0.479342 -0.481048 -0.573525 -0.012424 0.532864 -0.495792 0.209420 -0.465714 0.155549 -0.374799 -0.325338 -0.204320 0.233398 0.197041 0.225646 0.315047 0.229543 0.210012 0.199376 0.246635 0.228189 0.237774 0.366141 0.359943
chargesum: 0.00000
title: Mulliken charges with hydrogens summed into heavy atoms:
elementType: O O O O C C C C C C C C C C
charge: -0.267956 -0.266323 -0.113202 -0.121104 -0.143086 0.213221 0.532864 -0.180744 0.209420 -0.236170 0.155549 0.034590 -0.078702 0.261643
polarizability: 1.68935401e+02 -1.03690168e+01 1.21342362e+02 -8.35315536e+00 -2.30713990e+00 7.02332145e+01
1716.lowfreq: -9.1012 -3.0185 -0.0008 -0.0004 0.0005 10.2061 30.5021 48.2337 73.1836
frequency: 30.4477 48.2298 73.1604 86.5384 121.0012 181.7211 213.2311 224.1529 244.0621 257.9101 316.3724 344.0292 412.6015 420.5581 448.6984 494.4623 510.4327 530.4048 597.9884 617.0532 676.3979 717.6733 749.1963 775.9858 806.7921 828.5380 840.9176 890.0318 913.2919 922.2941 928.8927 968.3476 976.9610 1029.3879 1042.8942 1058.3141 1063.1265 1072.0633 1124.1053 1128.1548 1172.1256 1183.2374 1191.6471 1217.9010 1248.3417 1255.0858 1275.9936 1304.7399 1349.6651 1364.1325 1376.7819 1397.5401 1408.6415 1438.8269 1447.4980 1460.2721 1475.6502 1485.8202 1611.3086 1630.2188 2953.1981 2966.3854 2978.9215 2991.6949 3019.7201 3037.2010 3100.8549 3130.4093 3175.3384 3178.3440 3507.2384 3599.9499
redmass: 4.4210 5.1407 3.2180 3.5930 3.5923 4.4123 4.6946 4.8729 1.1200 5.5204 5.7211 3.3615 4.6816 2.9203 2.4702 1.3002 4.1418 2.6183 5.1636 4.4126 9.0828 4.8330 5.3411 5.5559 1.3961 3.6216 8.0719 1.6475 3.6441 1.4885 1.3591 7.1518 5.1537 2.1269 2.9269 2.2057 2.9889 1.4975 1.3756 1.1065 1.1065 1.5754 1.2689 1.1482 4.6901 1.1902 1.2335 1.4279 1.4039 1.2636 1.5095 1.9791 2.1595 3.4892 1.2178 1.0888 2.1746 1.3272 7.8865 8.1718 1.0549 1.0805 1.0641 1.0614 1.1072 1.1006 1.1095 1.0900 1.0939 1.0953 1.0646 1.0669
irintensity: 2.1230 4.1825 10.1421 9.0952 3.6671 7.0505 2.9781 4.1101 142.9612 2.4117 2.0810 6.2377 9.9069 6.6434 4.8640 111.5319 30.7718 56.2714 9.0449 17.0410 0.9613 1.6111 4.3651 24.8593 41.5925 10.4698 40.5960 8.1540 4.6244 29.4365 4.4920 61.7157 143.3123 29.0541 58.9401 11.3098 8.2085 7.8022 7.9236 3.8174 20.6626 34.7972 8.9973 1.2314 167.9688 19.4606 17.2546 43.5381 3.1127 0.3760 6.5429 1.8962 12.7973 36.7306 35.8860 18.5936 124.5513 35.9873 5.1572 0.7728 42.0400 11.7955 54.6245 128.6239 47.4109 44.2302 35.2974 14.1767 4.2126 12.8764 23.4474 7.2340
temp: 298.150 k
press: 1.00000 atm
elementType: 8 8 8 8 6 6 6 6 6 6 6 6 6 6 1 1 1 1 1 1 1 1 1 1 1 1
symmnumber: 1
zpe: 536053.3 jmol-1
zpe.correction: 0.204172 hartree
zpe.thermalcorrener: 0.217467 hartree
zpe.thermalcorrenthalpy: 0.218411 hartree
zpe.thermalcorrgfe: 0.163121 hartree
zpe.sumelectzpe: -688.057255 hartree
zpe.sumelectthermal: -688.043960 hartree
zpe.sumelectthermalent: -688.043016 hartree
zpe.sumelectthermalfe: -688.098306 hartree
dipole: -3.0965 1.6509 -0.7387
dipole: 3.5861
quadrupole: -56.0950 -79.6233 -85.4223
quadrupole: -9.2919 -2.2253 1.2480
quadrupole: 17.6185 -5.9098 -11.7088 -9.2919 -2.2253 1.2480
hfenergy: -688.261427 hartree
pointgroup: C01[X(C10H12O4)]
dipole: -1.2455643 0.6520869 -0.1179275 debye
dipolederiv: -1.0631005 0.3682018 0.225005 0.5108409 -0.7222143 -0.1383127 0.1994866 -0.0974557 -0.322394 -1.2676528 0.3265171 0.2368176 0.318584 -0.5606146 -0.1232739 0.2065015 -0.1016028 -0.3198992 -0.5872608 0.0160683 0.1340089 -0.0029192 -0.7739378 0.0311369 0.1433697 0.0456884 -0.4105906 -0.5980516 -0.2248126 -0.221045 -0.2775717 -0.5578201 0.0120286 -0.315747 -0.0111247 -0.5936932 0.03192 -0.0605721 -0.0336618 -0.0915426 0.1004998 -0.0087089 -0.0075242 -0.0717922 0.0669555 0.2741684 0.0074167 -0.0338653 0.127299 0.5609018 -0.0817711 0.0548427 -0.0471914 0.3233262 0.2644613 -0.0014569 -0.0628144 0.0923218 -0.0063566 -0.0423894 -0.1438448 -0.000318 -0.0551517 -0.2086882 0.1142075 -0.0109079 0.0541917 -0.0374236 0.0105538 0.0031099 -0.0087511 -0.1525002 0.3917356 -0.3145553 -0.0699869 -0.8939497 0.6254535 0.2164277 -0.0966815 0.1031527 0.0601 -0.1687845 0.0623243 -0.0047024 -0.0832697 0.0041895 0.0394269 -0.0213554 0.0006885 -0.1939103 1.0933044 -0.3830161 -0.2314078 0.0784357 -0.1068114 -0.0509271 -0.1707352 0.0421759 0.0546415 0.3771744 0.2383248 0.1618771 0.1465991 0.3522965 0.0468743 0.1593484 0.0480793 0.4333982 -0.0700888 -0.0106786 -0.038269 0.11318 0.0632387 0.0018239 0.0022895 0.0257881 -0.1463636 0.9796638 -0.223032 -0.1785403 -0.2633901 0.6722319 0.1081695 -0.230822 0.120416 0.6855774 -0.0454267 -0.0197699 0.0620207 -0.0346004 0.0717945 0.0893408 0.0645357 0.0368812 -0.0793309 0.0163648 0.0365431 0.0043357 0.10927 -0.1297494 -0.0242866 -0.0184297 0.0152462 0.0881795 0.0424729 -0.0091101 0.0596915 0.0080644 -0.0326252 0.0347756 0.0630042 0.0734223 -0.1621153 0.2177322 -0.0164248 0.0250361 -0.0148732 0.0520541 -0.0053204 0.0225908 -0.0100319 0.1660674 0.02073 0.1116765 0.0391021 0.0884453 -0.0490378 -0.0340119 0.0324058 -0.0352845 0.1468548 0.0110081 -0.0273476 0.029592 -0.0601562 0.0285073 0.0045515 0.0478895 -0.0429448 -0.2021055 0.0292804 0.0175622 -0.0389029 0.0092507 -0.2054903 0.0200632 -0.0531184 0.0602096 0.0215589 0.0388098 -0.0804102 0.0172373 -0.0806866 -0.0146377 -0.0024349 0.0230178 0.0001966 0.1733096 -0.0020265 0.0251478 0.0210086 0.0324146 0.0280978 -0.0191612 0.1639726 -0.0928301 -0.1989223 -0.1093463 0.0987565 -0.0281053 0.1028379 0.0197699 0.0140554 -0.08362 0.0464746 0.0184667 0.2798394 -0.0955571 -0.1069968 -0.0745211 0.3107104 -0.0256214 -0.1257589 -0.0309625 0.2572476 0.0517614 0.0439966 0.0434732 0.0857451 0.3069732 -0.0730085 0.0812723 -0.0681293 0.3412936 unknown
polarizability: 169.2109976|-6.1497723|119.1051375|-12.0401345|9.083292|72.1948429 unknown
InChI: InChI=1S/C10H12O4/c11-5-8(12)3-7-1-2-9-10(4-7)14-6-13-9/h1-2,4,8,11-12H,3,5-6H2
charge 0 multiplicity 1
26 atoms
O  2.57279 -1.645841 -0.214146
O  3.784115 0.423514 -0.281709
O  -2.54986 -1.590588 0.204226
O  -4.907309 -0.765918 -0.834027
C  -1.831239 0.639981 0.866516
C  -2.714204 -0.160315 -0.10986
C  -0.342063 0.627506 0.539813
C  0.329125 -0.612334 0.302591
C  1.693483 -0.553919 0.022274
C  0.385013 1.844193 0.496868
C  2.408727 0.662615 -0.018208
C  -4.199745 0.204534 0.025259
C  1.780601 1.88537 0.219164
C  3.862955 -1.025534 -0.606568
H  -2.006796 0.212424 1.874397
H  -2.186608 1.688608 0.890941
H  -2.400052 0.027797 -1.158945
H  -0.22452 -1.554105 0.335223
H  -0.141369 2.788074 0.680193
H  -4.518241 0.098422 1.083524
H  -4.376017 1.244473 -0.318631
H  2.335143 2.826829 0.192711
H  4.003477 -1.142152 -1.698542
H  4.67469 -1.480683 -0.018046
H  -3.267228 -2.067588 -0.293157
H  -5.885267 -0.676465 -0.72576
