program: Gaussian 09
title: 000097792
version: EM64L-G09RevD.01
frameworkgroup: C1[X(C6H12O3)]
method: RPBEPBE
basis: SDD
operation: Freq
keyword: #pfreq=noraman
keyword: PBEPBE/SDD
title: #p freq=noraman PBEPBE/SDD
converged: YES YES NO NO
title: Mulliken charges:
elementType: O O O C C C C C C H H H H H H H H H H H H
charge: -0.300642 -0.421418 -0.444722 -0.005234 -0.057881 -0.476819 -0.477777 -0.344892 -0.320593 0.192545 0.239566 0.229130 0.228200 0.238987 0.216041 0.235187 0.185086 0.181807 0.215706 0.329159 0.358565
chargesum: 0.00000
title: Mulliken charges with hydrogens summed into heavy atoms:
elementType: O O O C C C C C C
charge: -0.300642 -0.092259 -0.086156 0.187311 0.181685 -0.019489 -0.022749 0.075380 0.076920
polarizability: 8.30298074e+01 1.01774565e+00 7.42871860e+01 -9.97800364e-01 -2.58184335e-01 6.19665163e+01
1716.lowfreq: -5.2064 -0.0006 0.0002 0.0005 12.3018 20.6452 31.0432 86.6810 107.2183
frequency: 30.8363 86.6580 107.2034 122.3401 208.2676 239.4533 260.1701 371.7543 408.5280 421.8362 479.5212 512.1918 575.1509 633.5036 751.7778 852.9575 869.1644 894.8329 942.9111 960.8158 969.7173 986.1111 1024.4249 1051.1444 1080.2907 1093.6410 1116.0899 1146.3977 1175.5389 1189.2395 1202.8277 1266.7262 1268.7872 1299.8990 1305.3525 1318.2164 1323.2136 1343.5757 1357.0068 1383.6954 1388.1897 1448.1737 1458.3426 1460.2547 1475.8196 2909.5440 2936.2073 2943.0398 2999.2721 3006.1752 3021.1925 3060.3038 3075.1382 3086.9081 3091.1395 3518.3811 3555.2858
redmass: 4.3008 3.7116 3.1768 2.6443 1.8863 3.3411 1.2883 4.1913 3.5755 2.6399 2.5943 1.1220 2.2325 3.2291 3.9796 2.3965 1.8856 1.7629 1.6233 3.5672 4.4212 2.0408 3.5400 2.7522 2.9604 1.7500 2.4873 1.3221 1.3912 1.2626 1.3718 1.2511 1.3132 1.2184 1.2605 1.2692 1.2425 1.2525 1.3576 1.2760 1.3444 1.0833 1.0887 1.0923 1.0992 1.0835 1.0687 1.0694 1.0648 1.0622 1.0855 1.0953 1.1000 1.1012 1.0952 1.0651 1.0662
irintensity: 0.9055 1.2838 7.0476 5.7559 28.7532 1.2995 122.3182 2.1043 6.2897 21.7123 19.8704 157.2662 4.2339 5.0207 14.9690 31.6505 24.6766 1.7484 35.6832 72.8601 67.5397 13.5177 67.3664 52.3671 5.6903 3.0342 0.7397 22.6467 17.1048 3.8296 17.9084 10.6203 1.2953 4.9243 2.7051 1.4531 20.7302 9.3372 22.3604 24.1306 30.1301 2.2053 0.3688 12.4071 12.2126 54.6353 67.4172 72.7819 28.1790 30.8502 30.1542 36.0034 18.0419 25.2051 46.9288 11.9549 5.8816
temp: 298.150 k
press: 1.00000 atm
elementType: 8 8 8 6 6 6 6 6 6 1 1 1 1 1 1 1 1 1 1 1 1
symmnumber: 1
zpe: 466933.2 jmol-1
zpe.correction: 0.177845 hartree
zpe.thermalcorrener: 0.187730 hartree
zpe.thermalcorrenthalpy: 0.188674 hartree
zpe.thermalcorrgfe: 0.141831 hartree
zpe.sumelectzpe: -460.727363 hartree
zpe.sumelectthermal: -460.717479 hartree
zpe.sumelectthermalent: -460.716534 hartree
zpe.sumelectthermalfe: -460.763378 hartree
dipole: -1.2791 4.6132 2.1324
dipole: 5.2407
quadrupole: -63.2705 -58.1448 -51.3113
quadrupole: 2.3778 -3.5309 -3.4865
quadrupole: -5.6950 -0.5692 6.2642 2.3778 -3.5309 -3.4865
hfenergy: -460.9052085 hartree
pointgroup: C01 [X(C6H12O3)]
dipole: 0.5675767 -1.8417278 0.7328346 debye
dipolederiv: -1.0521259 0.0726719 -0.1000857 0.0423515 -0.4947248 0.0121772 -0.1254448 -0.0264975 -0.3903788 -0.7129375 -0.1377236 -0.0405809 -0.1690809 -0.7100817 -0.1752074 -0.0604739 -0.2142202 -0.1651141 -0.3001545 0.1252948 0.0365919 0.2176485 -0.8090354 0.0224574 0.0690248 -0.0071356 -0.5636995 0.5191447 -0.120674 0.1102648 -0.2685022 0.1975054 -0.1009227 0.2895877 0.0341069 0.4037508 0.5902167 0.0613407 0.062653 0.1968222 0.1989345 0.0877262 0.1095041 0.0407161 0.2677593 -0.0385021 -0.0973785 -0.0049636 0.0266486 -0.0824426 -0.0400109 -0.0573428 -0.00189 0.1380829 -0.0860664 0.0992418 0.0001025 -0.0011173 -0.0776425 0.0472529 -0.0268448 -0.0304607 0.1420621 0.3971631 0.1116795 0.0553538 0.0859507 0.6267707 0.1304047 0.0777829 0.1427294 0.2502453 0.23313 -0.0494706 0.0516677 -0.0659711 0.5735378 -0.1247655 0.0298792 -0.0612507 0.3558961 -0.0387599 -0.0066899 -0.0075299 0.0387243 0.0072405 -0.0274041 -0.0888235 -0.0308388 -0.2401343 -0.0363019 -0.0071703 -0.0388894 -0.0340845 0.0387586 0.0044325 -0.0811963 -0.0131745 -0.1434366 0.0027466 0.1006906 -0.0532069 0.0882381 -0.0213768 0.0731595 -0.0776288 0.1086358 0.0085829 0.0230701 0.0079938 0.0617431 0.001235 0.0685644 -0.0102145 0.0891736 -0.0672706 -0.1127731 0.0199873 -0.0878609 -0.0412564 -0.0773153 -0.0485044 -0.0694771 -0.0533092 -0.1067794 0.025292 0.0270943 -0.0084685 0.0547088 -0.0089271 0.0756204 -0.0013406 0.0787619 0.0749776 -0.1303991 0.0946085 -0.0159672 -0.0370113 -0.024561 0.0458982 -0.0074202 0.0031475 -0.0319424 -0.1004259 -0.1133254 0.0995816 -0.0333896 0.0957317 -0.1658011 0.0019298 -0.0744734 0.047386 0.0528343 0.0253222 0.0525513 -0.113451 0.0363715 -0.037947 0.053334 -0.0489617 0.072329 -0.2061607 -0.112846 -0.1028034 -0.0068902 -0.0715687 -0.0153692 0.0065778 -0.0321328 -0.016124 0.0832565 0.4158942 0.0204524 0.0566038 0.0134577 0.2723326 0.0968399 0.027739 0.0438909 -0.0149548 0.1426418 -0.1172915 -0.0124346 -0.1220518 0.3577625 0.020471 -0.0479687 0.0428126 0.3397147 unknown
polarizability: 82.9707016|1.2487857|74.2912048|0.8902734|0.9686038|62.0216033 unknown
InChI: InChI=1S/C6H12O3/c7-3-5-1-2-6(4-8)9-5/h5-8H,1-4H2
charge 0 multiplicity 1
21 atoms
O  -0.032395 0.504377 -0.359711
O  2.763194 1.600812 0.200447
O  -2.579346 1.630917 0.023707
C  1.069725 -0.256688 0.275731
C  -1.238369 -0.384424 -0.450563
C  0.767812 -1.730678 -0.076179
C  -0.779812 -1.794422 0.002907
C  2.412195 0.252733 -0.256261
C  -2.334875 0.24591 0.421031
H  1.021856 -0.111399 1.380903
H  -1.547632 -0.358676 -1.512006
H  1.259461 -2.44024 0.61153
H  1.113725 -1.943317 -1.105119
H  -1.199803 -2.591003 -0.632821
H  -1.09941 -1.983642 1.045837
H  2.362827 0.331497 -1.354367
H  3.205937 -0.476456 0.021546
H  -2.033112 0.182025 1.490615
H  -3.295748 -0.282379 0.288785
H  2.751245 1.621496 1.191193
H  -1.686574 2.062459 -0.050003
