program: Gaussian 09
title: 000097794
version: EM64L-G09RevD.01
frameworkgroup: C1[X(C16H12O4)]
method: RPBEPBE
basis: SDD
operation: Freq
keyword: #pfreq=noraman
keyword: PBEPBE/SDD
title: #p freq=noraman PBEPBE/SDD
converged: YES YES NO NO
title: Mulliken charges:
elementType: O O O O C C C C C C C C C C C C C C C C H H H H H H H H H H H H
charge: -0.441636 -0.441639 -0.250387 -0.250387 0.525620 0.525627 -0.318650 -0.318673 -0.382964 -0.382966 -0.398394 -0.398403 0.247376 0.247384 -0.363897 -0.363909 -0.339527 -0.339531 0.105986 0.105988 0.221507 0.221506 0.228667 0.228676 0.233049 0.233065 0.271694 0.271696 0.276217 0.276219 0.385343 0.385343
chargesum: 0.00000
title: Mulliken charges with hydrogens summed into heavy atoms:
elementType: O O O O C C C C C C C C C C C C C C C C
charge: -0.056293 -0.056296 -0.250387 -0.250387 0.525620 0.525627 -0.097143 -0.097167 -0.154297 -0.154290 -0.165345 -0.165339 0.247376 0.247384 -0.092203 -0.092213 -0.063309 -0.063312 0.105986 0.105988
polarizability: 5.22531673e+02 -3.74691735e+00 1.79984145e+02 2.46334224e-02 2.16949418e-02 7.09549866e+01
1716.lowfreq: -3.6732 -0.0007 -0.0005 0.0007 3.2787 5.9418 22.0492 25.1414 44.5732
frequency: 22.0491 25.1414 44.5732 57.3766 75.0721 75.4275 130.0821 144.0898 152.6461 168.8386 197.9093 281.1272 281.5388 324.1873 343.7115 406.5463 407.5502 423.4316 440.8227 470.5109 495.1144 506.3064 523.4434 568.7161 586.8876 592.2400 604.9496 629.7002 635.4935 683.6598 689.4871 711.5373 741.0257 753.1512 774.2379 825.1606 841.3108 850.2411 854.8722 868.1768 868.6753 913.5102 976.5369 991.6566 996.3263 997.6591 997.8638 999.6437 1001.7713 1020.3059 1021.4763 1119.6605 1121.7037 1149.4371 1149.5396 1197.7697 1201.0753 1204.8168 1250.5615 1291.8324 1301.1805 1320.1145 1323.1927 1323.2025 1331.9471 1380.5668 1396.2203 1423.3125 1425.1089 1494.7154 1509.7417 1561.2260 1565.6097 1607.8478 1619.9718 1635.1509 1638.0148 1648.1780 3095.9461 3106.5069 3129.7185 3129.9959 3141.5820 3141.7251 3164.1047 3164.1417 3179.2466 3179.3012 3533.3560 3533.4433
redmass: 4.8345 7.9848 7.0590 6.0436 6.9839 6.2839 8.4440 6.1624 2.7461 7.8696 6.2396 5.4737 3.0962 4.6113 8.5458 2.8535 2.7982 6.4544 6.1560 2.6850 6.7641 4.7171 2.6843 5.3075 1.2178 1.2528 4.7552 7.1465 7.0830 3.5226 3.3111 5.1079 5.3443 3.4070 4.2616 5.7042 1.5284 1.2689 1.3604 4.1690 1.7350 2.1476 1.2176 1.4016 1.3774 4.7129 1.3765 4.5571 1.2736 2.7198 2.8268 1.3973 1.4739 1.6769 1.6477 1.1751 1.2528 2.4412 1.4184 2.0801 1.4094 1.9542 2.2804 2.8232 1.3476 4.5049 3.4159 4.1594 3.6549 2.5021 2.8126 7.2153 6.4280 5.5492 6.2471 6.9873 8.5566 6.3060 1.0921 1.0861 1.0901 1.0900 1.0876 1.0877 1.0965 1.0965 1.0949 1.0950 1.0642 1.0642
irintensity: 1.1271 0.2309 0.4267 0.0000 0.0003 1.5079 0.0000 0.0607 0.0000 0.0000 3.8727 0.0000 0.0000 7.5131 34.6295 0.0945 0.0000 0.0000 5.7310 0.0000 0.0000 16.6378 100.9259 70.1756 0.0001 138.1318 0.0000 0.0000 0.5797 0.0000 171.6997 43.6584 0.0000 0.0000 13.5511 0.2189 0.0000 0.7836 0.0000 0.0924 84.7050 0.0000 56.2699 0.0002 4.8288 543.6673 0.1455 0.0022 12.1689 405.7143 0.0004 14.7963 0.0001 404.5096 0.0077 9.5652 0.0002 0.0000 11.9184 2.2787 0.0000 165.2205 281.7464 6.7474 0.0000 0.0000 0.5839 0.0088 45.2655 0.0000 15.5052 0.0036 73.2337 0.0010 422.1903 0.0001 775.9027 0.0000 0.0000 35.4630 1.1604 25.5526 0.7752 7.6485 1.6102 8.7226 3.5191 0.0424 140.6421 0.5193
temp: 298.150 k
press: 1.00000 atm
elementType: 8 8 8 8 6 6 6 6 6 6 6 6 6 6 6 6 6 6 6 6 1 1 1 1 1 1 1 1 1 1 1 1
symmnumber: 1
zpe: 626152.6 jmol-1
zpe.correction: 0.238489 hartree
zpe.thermalcorrener: 0.255816 hartree
zpe.thermalcorrenthalpy: 0.256760 hartree
zpe.thermalcorrgfe: 0.190643 hartree
zpe.sumelectzpe: -916.434638 hartree
zpe.sumelectthermal: -916.417311 hartree
zpe.sumelectthermalent: -916.416367 hartree
zpe.sumelectthermalfe: -916.482484 hartree
dipole: -0.0003 0.0000 -0.0004
dipole: 0.0005
quadrupole: -122.3300 -109.9188 -120.7694
quadrupole: -24.5242 0.0060 0.0023
quadrupole: -4.6573 7.7540 -3.0967 -24.5242 0.0060 0.0023
hfenergy: -916.673127 hartree
pointgroup: C01 [X(C16H12O4)]
dipole: -0.000128 -0.0000141 0.0001539 debye
polarizability: 522.5026394|4.8973569|180.0131791|-0.0247062|0.0216121|70.9549866 unknown
InChI: InChI=1S/C16H12O4/c17-15(18)13-7-3-11(4-8-13)1-2-12-5-9-14(10-6-12)16(19)20/h1-10,17,19H
charge 0 multiplicity 1
32 atoms
O  6.96059 1.012657 -0.025629
O  -6.959869 -1.012825 -0.022513
O  6.844165 -1.307824 -0.02602
O  -6.843365 1.307652 -0.023895
C  1.93744 0.2766 -0.023641
C  -1.936787 -0.276936 -0.027031
C  0.484157 0.486464 -0.023127
C  -0.483438 -0.486847 -0.027431
C  2.547969 -1.015558 -0.023731
C  -2.547174 1.015254 -0.027309
C  2.792112 1.419534 -0.023868
C  -2.791402 -1.419861 -0.026471
C  4.779855 -0.002103 -0.024931
C  -4.779094 0.001869 -0.025024
C  3.943359 -1.152242 -0.024427
C  -3.942576 1.151988 -0.026225
C  4.191421 1.288838 -0.024578
C  -4.190722 -1.289098 -0.02532
C  6.249993 -0.201277 -0.025652
C  -6.249224 0.201088 -0.023796
H  0.172072 1.540305 -0.018869
H  -0.171435 -1.540715 -0.031317
H  1.926616 -1.916922 -0.022921
H  -1.925784 1.916576 -0.028984
H  2.342794 2.419895 -0.023676
H  -2.342126 -2.420227 -0.026717
H  4.415198 -2.14033 -0.024423
H  -4.414411 2.140079 -0.026465
H  4.83779 2.170575 -0.024835
H  -4.837153 -2.170792 -0.024676
H  7.934136 0.809555 -0.026047
H  -7.933405 -0.809671 -0.021753
