program: Gaussian 09
title: 000097779
version: EM64L-G09RevD.01
frameworkgroup: C1[X(C8H9ClO)]
method: RPBEPBE
basis: SDD
operation: Freq
keyword: #p
keyword: freq=noraman
keyword: PBEPBE/SDD
title: #p freq=noraman PBEPBE/SDD
converged: YES YES NO NO
title: Mulliken charges:
elementType: Cl O C C C C C C C C H H H H H H H H H
charge: -0.073166 -0.472122 -0.180299 0.463576 -0.701238 -0.353111 -0.423274 -0.073383 -0.207611 -0.245936 0.205659 0.230952 0.244267 0.208278 0.308389 0.234005 0.230638 0.256126 0.348251
chargesum: 0.00000
title: Mulliken charges with hydrogens summed into heavy atoms:
elementType: Cl O C C C C C C C C
charge: -0.073166 -0.123871 0.025359 0.463576 -0.017741 -0.044722 -0.189269 -0.073383 0.023027 0.010190
polarizability: 1.29867265e+02 -4.53189999e+00 1.05706788e+02 2.94828803e+00 -1.68844516e+00 5.06596883e+01
1716.lowfreq: -11.0261 -1.1373 0.0005 0.0018 0.0023 9.5015 32.2560 128.2483 151.5699
frequency: 32.1529 128.2387 151.5689 181.8708 250.2989 265.5926 288.3552 321.0928 371.0434 392.1536 445.2028 462.0123 550.0271 600.5582 663.1910 698.6417 787.4980 799.0858 878.5632 902.1240 923.0521 974.6898 984.7703 1005.4554 1053.0609 1070.6019 1078.5416 1097.9748 1154.7086 1177.8566 1226.2271 1281.8050 1295.5355 1371.0576 1384.7047 1389.6698 1420.8330 1459.6604 1465.1178 1476.7431 1579.3196 1610.3392 2942.3749 2977.1104 3070.8659 3096.3644 3122.8157 3148.8866 3174.3978 3190.5151 3577.1809
redmass: 3.7634 3.6158 6.4596 4.9064 1.0965 1.1366 3.3609 4.1197 5.1712 6.1341 3.3167 3.3989 4.9068 3.8154 6.3231 2.2063 1.4632 3.4743 2.7591 1.3773 1.3415 1.3436 5.8054 2.0031 2.0106 2.0278 2.3103 1.5555 1.6508 1.0919 1.4035 1.2763 1.2408 2.0253 4.1738 1.2148 2.5557 1.6205 1.0549 1.4085 6.7729 6.7090 1.0838 1.0373 1.0977 1.1003 1.0880 1.0927 1.0974 1.0924 1.0662
irintensity: 2.3977 3.3561 0.7771 0.7061 0.2271 142.4286 14.9102 8.9976 6.6385 7.0318 6.0943 3.3196 5.9371 3.0528 13.9161 34.2343 53.7017 35.3882 44.0142 0.7768 19.6608 0.3128 2.1861 2.5162 76.3483 19.7070 3.2907 20.7377 37.2964 0.5638 15.0086 9.2079 9.1950 29.1671 9.5838 13.0227 38.7571 13.6977 8.6445 12.9812 42.4108 25.3021 47.3252 32.7336 40.6829 20.1420 9.6059 15.5003 7.2822 3.5146 5.1334
temp: 298.150 k
press: 1.00000 atm
elementType: 17 8 6 6 6 6 6 6 6 6 1 1 1 1 1 1 1 1 1
symmnumber: 1
zpe: 388496.3 jmol-1
zpe.correction: 0.147970 hartree
zpe.thermalcorrener: 0.157816 hartree
zpe.thermalcorrenthalpy: 0.158761 hartree
zpe.thermalcorrgfe: 0.112023 hartree
zpe.sumelectzpe: -844.784873 hartree
zpe.sumelectthermal: -844.775027 hartree
zpe.sumelectthermalent: -844.774083 hartree
zpe.sumelectthermalfe: -844.820820 hartree
dipole: -3.7902 1.8834 0.4759
dipole: 4.2590
quadrupole: -56.3217 -61.3571 -69.9464
quadrupole: 5.1610 -0.0918 -1.1810
quadrupole: 6.2200 1.1846 -7.4046 5.1610 -0.0918 -1.1810
hfenergy: -844.9328432 hartree
pointgroup: C01 [X(C8H9Cl1O1)]
dipole: 1.2833407 -0.8533892 0.6575966 debye
dipolederiv: -0.4774304 0.3172851 -0.1173009 0.366764 -0.4889135 0.147388 -0.1244665 0.1395502 -0.1357338 -0.3085561 -0.1139443 0.147454 -0.1651089 -0.6311246 0.0999199 0.1927496 0.1019226 -0.7153806 0.3835657 0.082932 -0.0878229 0.1933584 0.5325458 -0.0792868 -0.2059615 -0.1075335 0.5323239 0.2733098 0.0500743 0.034746 -0.0204741 0.0418413 -0.0100084 0.0355253 -0.0241419 -0.0694956 -0.0353633 -0.0092427 -0.0896841 -0.0595431 -0.0057951 -0.0058438 0.0399954 0.0356063 -0.1617657 -0.3607839 0.130864 -0.0718502 0.1439502 -0.1548833 0.0214777 -0.0848198 0.0010406 -0.0977624 -0.1426246 -0.0746102 0.0060442 -0.106373 -0.0462909 -0.0549137 0.0321205 -0.0454899 -0.159269 0.6865961 -0.5024837 0.1769316 -0.5466354 0.691201 -0.2692702 0.1968327 -0.2560927 0.0433577 0.0946068 -0.0246944 0.0098866 0.0426868 0.0920158 -0.0742643 -0.014902 -0.0787063 -0.1132507 -0.1252538 0.1173845 -0.0524995 0.1232466 -0.2666957 0.0470274 -0.0434041 0.0465397 -0.1493492 -0.0679128 0.0551344 0.0462587 0.0503117 -0.1651329 -0.0492337 0.0413228 -0.0504142 -0.0376464 0.11656 -0.0515909 0.0300834 -0.0257534 -0.0533503 0.120801 0.0365295 0.085897 0.0093011 0.0682052 0.0915453 0.0386607 0.0520939 -0.0379572 -0.1012924 0.0113293 -0.0472886 0.0425319 -0.2443884 -0.0473528 -0.0159685 -0.0632331 0.0947706 -0.0163228 -0.0037452 -0.0000638 0.0533824 0.1720433 -0.0096023 0.0089012 -0.0208978 0.049484 0.0353743 -0.0016545 0.0365802 0.1509218 -0.0104415 0.1134155 -0.031441 0.1004935 0.0059742 0.0526269 -0.0281774 0.0528335 0.130125 0.0454626 -0.0529628 0.0164838 -0.0595915 -0.0750324 0.0769827 0.0224663 0.0786761 0.1320273 -0.054551 -0.0259346 0.0097062 -0.0146444 0.1068808 0.0222286 0.0047608 0.0230322 0.1635462 -0.0130436 -0.0462165 -0.0585894 0.0093496 0.3104624 0.0366095 -0.1065012 0.0080525 0.3821361 unknown
polarizability: 126.8606623|-7.2484555|101.5739169|6.7360245|-19.0070861|57.799162 unknown
InChI: InChI=1S/C8H9ClO/c1-6(10)7-3-2-4-8(9)5-7/h2-6,10H,1H3
charge 0 multiplicity 1
19 atoms
Cl -2.830974 1.88473 -0.802844
O  2.354848 1.21093 -0.977981
C  2.129317 0.018014 -0.143051
C  0.624009 -0.224987 -0.095126
C  2.72483 0.218048 1.270284
C  -0.28257 0.803308 -0.446179
C  0.125843 -1.479355 0.338012
C  -1.662744 0.552707 -0.346263
C  -1.26514 -1.703742 0.428732
C  -2.181887 -0.681716 0.086705
H  2.615074 -0.862806 -0.61816
H  2.524261 -0.657563 1.91292
H  2.275471 1.106969 1.746627
H  3.822336 0.357374 1.221507
H  0.104052 1.760742 -0.801406
H  0.822843 -2.285558 0.597619
H  -1.644893 -2.675913 0.760899
H  -3.261607 -0.84445 0.149739
H  3.31213 1.458268 -0.934735
