program: Gaussian 09
title: 000097781
version: EM64L-G09RevD.01
frameworkgroup: C1[X(C12H17NO2)]
method: RPBEPBE
basis: SDD
operation: Freq
keyword: #p
keyword: freq=noraman
keyword: PBEPBE/SDD
title: #p freq=noraman PBEPBE/SDD
converged: YES YES NO NO
title: Mulliken charges:
elementType: O O N C C C C C C C C C C C C H H H H H H H H H H H H H H H H H
charge: -0.266670 -0.242850 -0.303997 -0.166283 -0.390816 -0.481819 -0.698685 0.426173 0.218447 -0.375759 -0.442897 -0.223360 -0.221071 -0.242746 -0.504973 0.230917 0.200080 0.230788 0.251466 0.227787 0.195403 0.217448 0.227558 0.248207 0.262975 0.232071 0.224308 0.224548 0.227093 0.233187 0.241729 0.241740
chargesum: 0.00000
title: Mulliken charges with hydrogens summed into heavy atoms:
elementType: O O N C C C C C C C C C C C C
charge: -0.266670 -0.242850 -0.052531 0.064635 0.040052 -0.058629 -0.005473 0.426173 0.218447 -0.112784 -0.210826 0.000949 0.003477 -0.015652 0.211682
polarizability: 1.93702993e+02 -4.95361383e+00 1.32565508e+02 7.23586166e+00 -2.10312260e+00 9.62343635e+01
1716.lowfreq: -14.7322 -4.4118 -0.0007 -0.0006 0.0006 1.6858 15.7849 22.8142 26.3099
frequency: 13.6589 22.6825 25.9473 43.8997 80.7729 95.5357 111.4968 134.5907 186.3588 199.4740 205.0895 228.0564 266.1792 290.2877 312.7368 323.0323 405.3237 412.0984 470.3074 515.8327 592.0866 616.6271 666.3092 693.7509 707.7234 718.9044 749.4749 808.3378 810.6190 858.7888 873.3895 910.3085 924.1530 954.8825 968.7865 980.9948 989.9559 996.4367 1023.7742 1025.9668 1067.2572 1080.4566 1101.5413 1102.7745 1113.6132 1140.4751 1147.1765 1148.3845 1170.0743 1181.0958 1204.9724 1213.0525 1257.4468 1295.9118 1317.5439 1317.9499 1343.4694 1372.1771 1379.3316 1392.4055 1421.2262 1439.7414 1452.5239 1452.6596 1464.1341 1467.3203 1475.1868 1481.3499 1483.6570 1490.9889 1594.1899 1614.7533 1641.7764 2864.5467 2871.4194 2975.0558 2988.6557 3004.2974 3016.2857 3035.1944 3088.7046 3101.6121 3105.9434 3114.2098 3123.8417 3137.3843 3148.7155 3150.7022 3162.9094 3430.8430
redmass: 4.4848 3.9482 4.0191 4.4272 2.9492 1.1729 3.1377 2.5126 3.1378 1.3807 4.1137 2.2735 2.6627 3.7043 3.9727 3.3688 2.9114 3.7376 3.0864 2.9582 4.8933 6.2916 3.3353 1.8290 2.0366 3.1035 1.5878 3.7471 3.4039 1.2461 3.1511 1.3798 1.3430 3.2431 1.9905 1.3829 6.2187 1.3374 1.9888 2.0251 2.2981 1.6589 3.1705 2.0430 1.3592 1.7215 1.7620 2.5372 1.0595 1.1103 1.3794 2.5125 1.2834 1.3377 1.3385 1.3358 1.4717 1.4817 1.7757 2.2907 1.1905 2.1170 1.1387 1.1146 1.0506 1.0531 1.2740 1.1787 1.4072 1.1454 6.1496 6.1359 8.7363 1.0710 1.0709 1.0868 1.0345 1.0295 1.0844 1.0884 1.1006 1.1001 1.1045 1.0866 1.0867 1.0921 1.1048 1.0953 1.1011 1.0743
irintensity: 1.6306 0.3181 0.3539 0.3529 1.8817 0.1810 0.8036 1.8931 7.4274 2.6087 1.0798 6.3055 1.2940 4.8084 7.1231 12.5138 0.3665 0.6148 8.8498 3.3008 2.3086 0.6512 24.0149 38.0210 43.4664 34.7084 59.6173 5.8314 13.0479 0.0837 7.2884 3.4924 1.9572 2.7405 16.6158 0.1089 0.1131 0.6551 3.2715 18.9145 97.1963 6.4379 254.4856 27.7864 7.9922 24.8270 19.8642 7.7889 0.2410 1.5771 24.3603 5.9408 2.5386 7.3116 9.8293 19.2345 50.7722 19.9212 15.6298 1.4137 22.9992 10.2196 13.7713 30.1341 11.9560 11.8047 18.6543 14.9493 13.2001 2.1543 0.6108 6.3807 152.9346 36.2415 159.1638 23.6300 25.3071 34.5577 0.6353 28.6059 31.6312 14.9189 26.6900 8.1581 0.6016 26.1786 16.8137 33.7404 20.5886 0.3127
temp: 298.150 k
press: 1.00000 atm
elementType: 8 8 7 6 6 6 6 6 6 6 6 6 6 6 6 1 1 1 1 1 1 1 1 1 1 1 1 1 1 1 1 1
symmnumber: 1
zpe: 701978.1 jmol-1
zpe.correction: 0.267369 hartree
zpe.thermalcorrener: 0.283527 hartree
zpe.thermalcorrenthalpy: 0.284471 hartree
zpe.thermalcorrgfe: 0.219994 hartree
zpe.sumelectzpe: -671.519433 hartree
zpe.sumelectthermal: -671.503276 hartree
zpe.sumelectthermalent: -671.502331 hartree
zpe.sumelectthermalfe: -671.566809 hartree
dipole: 0.2870 -0.6550 -1.8769
dipole: 2.0085
quadrupole: -78.6241 -84.3119 -95.9608
quadrupole: -0.2232 -6.1677 0.9860
quadrupole: 7.6749 1.9870 -9.6619 -0.2232 -6.1677 0.9860
hfenergy: -671.7868023 hartree
pointgroup: C01 [X(C12H17N1O2)]
dipole: 0.1153002 -0.4753162 -0.62067 debye
polarizability: 193.3804369|-3.158108|127.912648|9.531371|-12.5589535|101.2097797 unknown
InChI: InChI=1S/C12H17NO2/c1-10(12(14)15-2)8-13-9-11-6-4-3-5-7-11/h3-7,10,13H,8-9H2,1-2H3
charge 0 multiplicity 1
32 atoms
O  4.511341 -0.510031 -0.849104
O  4.121948 0.014628 1.386391
N  -0.098132 -0.2342 0.032933
C  2.313165 0.313207 -0.276121
C  1.260519 -0.472556 0.555419
C  -1.19268 -0.753949 0.883385
C  2.109612 1.844911 -0.147254
C  -2.565456 -0.376288 0.336727
C  3.708015 -0.061234 0.20612
C  -2.801518 0.92097 -0.186809
C  -3.634198 -1.306076 0.368088
C  -4.081881 1.28115 -0.661651
C  -4.918469 -0.946629 -0.102705
C  -5.146355 0.349356 -0.619384
C  5.903079 -0.87619 -0.483844
H  2.233036 0.018952 -1.339379
H  1.539044 -1.555722 0.57035
H  1.302038 -0.11905 1.603104
H  -0.198609 -0.553152 -0.941185
H  -1.058434 -0.308176 1.890924
H  -1.149911 -1.862164 1.027022
H  2.779521 2.3988 -0.828769
H  2.313217 2.172444 0.888052
H  1.062417 2.087537 -0.393419
H  -1.968303 1.631076 -0.220945
H  -3.461453 -2.315746 0.761982
H  -4.251699 2.28714 -1.062682
H  -5.735528 -1.676512 -0.071507
H  -6.139974 0.629105 -0.987507
H  6.362601 -1.207614 -1.425413
H  5.900659 -1.684766 0.266283
H  6.430891 -0.001222 -0.068601
