program: Gaussian 09
title: 000097775
version: EM64L-G09RevD.01
frameworkgroup: C1[X(C10H17NO2)]
method: RPBEPBE
basis: SDD
operation: Freq
keyword: #p
keyword: freq=noraman
keyword: PBEPBE/SDD
title: #p freq=noraman PBEPBE/SDD
converged: YES YES NO NO
title: Mulliken charges:
elementType: O O N C C C C C C C C C C H H H H H H H H H H H H H H H H H
charge: -0.213323 -0.213866 -0.347459 0.363170 -0.439733 -0.537712 -0.547392 -0.754791 -0.387499 0.121335 0.121846 -0.349474 -0.697782 0.194246 0.205732 0.256024 0.247499 0.246066 0.261690 0.218357 0.224643 0.230393 0.206530 0.206240 0.195550 0.196767 0.350518 0.211236 0.211518 0.219672
chargesum: 0.00000
title: Mulliken charges with hydrogens summed into heavy atoms:
elementType: O O N C C C C C C C C C C
charge: -0.213323 -0.213866 0.003059 0.363170 -0.039755 -0.034188 -0.039635 -0.081398 0.025270 0.121335 0.121846 0.042842 -0.055356
polarizability: 1.39792866e+02 4.94355470e+00 1.24375436e+02 -2.16838221e+00 1.30406421e+00 8.99132560e+01
1716.lowfreq: -5.5075 -0.0007 -0.0005 -0.0003 7.1290 11.3725 53.5244 69.0863 73.4556
frequency: 53.2686 68.8935 73.4395 89.1581 121.7058 140.9761 168.2665 212.5678 229.5057 236.4924 260.5575 314.5675 332.9652 345.8239 393.1518 432.3837 453.1442 508.3861 535.6015 557.9310 588.8753 620.9366 732.6020 782.5671 793.3519 807.9897 853.3523 888.2466 895.9508 903.4506 917.3642 925.7840 966.3815 981.2791 1031.9220 1053.5169 1078.0251 1096.6538 1137.5048 1139.8618 1163.6706 1210.5319 1232.5655 1255.1419 1268.3510 1277.1128 1282.5404 1296.8882 1314.1455 1324.1901 1330.7762 1337.4705 1359.2476 1370.4521 1391.5148 1396.8081 1434.4320 1442.8309 1457.9286 1467.0683 1476.5221 1478.0441 1480.1542 1485.3038 1488.3334 1636.9153 1640.5425 2946.1862 2963.3909 2972.0448 2973.7915 2974.5629 2975.0614 2982.6404 2995.8670 3008.0435 3040.7210 3068.1614 3070.7543 3073.0611 3074.4963 3076.9219 3083.9222 3483.1812
redmass: 2.6914 1.8664 4.0900 3.2907 3.1016 3.4944 2.9608 1.7948 1.1055 2.0193 2.2710 2.2901 2.5785 4.1091 2.9565 2.8358 4.0119 4.3742 2.6359 4.1072 3.3181 4.2606 1.0840 1.2630 1.7635 1.7684 4.6989 1.9851 1.7762 1.7781 2.0573 1.8294 1.9805 1.7653 2.8339 1.6076 2.4281 1.9778 1.7139 1.6137 1.8985 1.5169 1.6754 2.4074 1.4872 1.3899 1.7852 1.1976 2.2025 2.1616 1.5850 1.4433 1.5549 1.8482 1.2156 1.2016 1.0825 1.0797 1.0776 1.0699 1.0676 1.0424 1.0582 1.0596 1.0809 9.9083 5.7584 1.0595 1.0585 1.0644 1.0562 1.0519 1.0543 1.0388 1.0976 1.1012 1.1041 1.0940 1.1007 1.0988 1.0992 1.0933 1.0982 1.0760
irintensity: 0.6510 0.7513 0.3326 0.8993 2.8049 4.4887 0.8298 0.6272 0.0082 0.6853 0.2303 0.4710 4.6020 12.4016 7.6054 2.2530 9.6249 3.0201 3.7263 15.3815 6.3276 0.7103 8.9601 0.4285 46.5310 63.1981 5.8371 1.2980 2.9897 4.6555 8.9965 0.0754 1.6794 1.1514 1.5815 4.6714 0.7350 11.0179 20.3414 20.0585 9.2813 4.8960 8.8544 120.4936 12.5420 6.4340 124.8961 10.3914 58.6165 68.7256 6.2494 4.1208 3.3642 10.3979 10.9651 23.7364 4.6172 3.9179 2.7895 0.3745 3.1712 12.8008 5.0268 1.2198 24.9864 177.3611 431.3090 19.3638 11.5246 4.4237 24.9111 23.0548 76.2791 12.0285 11.5155 0.3755 52.0904 3.2007 75.4886 53.8923 46.2766 2.9975 31.4536 36.3224
temp: 298.150 k
press: 1.00000 atm
elementType: 8 8 7 6 6 6 6 6 6 6 6 6 6 1 1 1 1 1 1 1 1 1 1 1 1 1 1 1 1 1
symmnumber: 1
zpe: 674614.2 jmol-1
zpe.correction: 0.256947 hartree
zpe.thermalcorrener: 0.271016 hartree
zpe.thermalcorrenthalpy: 0.271961 hartree
zpe.thermalcorrgfe: 0.216046 hartree
zpe.sumelectzpe: -595.471292 hartree
zpe.sumelectthermal: -595.457223 hartree
zpe.sumelectthermalent: -595.456279 hartree
zpe.sumelectthermalfe: -595.512193 hartree
dipole: 4.0525 -1.0461 -0.3605
dipole: 4.2008
quadrupole: -90.3434 -94.4899 -77.2409
quadrupole: -2.8418 -0.1552 -0.4417
quadrupole: -2.9853 -7.1318 10.1171 -2.8418 -0.1552 -0.4417
hfenergy: -595.7282394 hartree
pointgroup: C01 [X(C10H17N1O2)]
dipole: -1.5939201 0.408826 -0.1541637 debye
polarizability: 139.7809424|4.9891633|124.3130651|2.2146338|-1.945317|89.9875505 unknown
InChI: InChI=1S/C10H17NO2/c1-3-4-5-10(2)6-8(12)11-9(13)7-10/h11H,3-7H2,1-2H3
charge 0 multiplicity 1
30 atoms
O  3.384524 1.80246 -0.132753
O  2.141775 -2.655728 0.020218
N  2.695302 -0.409279 -0.087235
C  -0.053719 0.367219 0.168646
C  -1.466474 0.785288 -0.343154
C  0.982923 1.357602 -0.438122
C  0.302797 -1.061086 -0.334846
C  0.010686 0.425437 1.718162
C  -2.657052 -0.085404 0.118636
C  2.437481 0.975429 -0.201733
C  1.755643 -1.464502 -0.113763
C  -4.005838 0.433446 -0.433439
C  -5.208569 -0.423365 0.015747
H  -1.448489 0.796401 -1.454356
H  -1.650233 1.833381 -0.025883
H  0.846127 2.377737 -0.03898
H  0.83608 1.423931 -1.53672
H  0.104753 -1.132619 -1.425168
H  -0.316332 -1.83451 0.149604
H  -0.280512 1.42823 2.081715
H  -0.670505 -0.313621 2.17495
H  1.028053 0.214462 2.095985
H  -2.516667 -1.134295 -0.212262
H  -2.709638 -0.106824 1.225266
H  -3.961281 0.458796 -1.5416
H  -4.154124 1.482455 -0.104663
H  3.677285 -0.679457 0.053031
H  -5.296817 -0.437378 1.118468
H  -5.100647 -1.470365 -0.324937
H  -6.157931 -0.032041 -0.393215
