program: Gaussian 09
title: 000097759
version: EM64L-G09RevD.01
frameworkgroup: C1[X(C10H18O2)]
method: RPBEPBE
basis: SDD
operation: Freq
keyword: #pfreq=noraman
keyword: PBEPBE/SDD
title: #p freq=noraman PBEPBE/SDD
converged: YES YES NO NO
title: Mulliken charges:
elementType: O O C C C C C C C C C C H H H H H H H H H H H H H H H H H H
charge: -0.297449 -0.257921 -0.404665 -0.344920 0.047463 -0.349537 -0.720723 -0.696236 0.171308 0.338685 -0.757673 -0.636336 0.188657 0.205577 0.186774 0.210290 0.231612 0.195967 0.191694 0.214092 0.252063 0.219306 0.211040 0.210811 0.215732 0.239563 0.237936 0.214201 0.227405 0.255286
chargesum: 0.00000
title: Mulliken charges with hydrogens summed into heavy atoms:
elementType: O O C C C C C C C C C C
charge: -0.297449 -0.257921 -0.010432 0.052145 0.279074 0.038124 -0.035263 -0.058653 0.171308 0.338685 -0.065973 -0.153645
polarizability: 1.39810736e+02 -1.23786362e+01 1.12910281e+02 -1.23145432e+01 -2.00592929e+00 9.73139555e+01
1716.lowfreq: -0.0005 -0.0004 -0.0003 4.2496 5.7592 18.5505 32.2122 40.8737 56.9943
frequency: 31.2628 40.6667 56.9170 68.4106 88.6883 127.6781 136.1265 150.6739 173.4509 218.3505 231.2688 237.5434 275.2950 306.9974 350.3935 377.9208 404.4472 456.1669 478.0321 499.0883 576.8348 635.6210 725.0053 758.2339 785.1635 808.2410 828.7635 891.7275 907.0647 915.6610 948.6420 988.5075 995.5666 1006.8082 1032.3432 1051.8514 1052.5488 1083.5568 1109.7376 1128.6675 1135.5649 1172.1868 1218.9630 1253.7101 1277.2571 1288.1658 1291.1519 1309.5983 1333.1084 1348.9303 1364.4023 1385.5427 1389.4680 1394.1396 1414.7686 1448.7736 1455.8892 1465.2445 1467.0832 1470.5620 1476.3638 1478.0804 1479.7528 1487.2659 1601.7545 1654.4887 2960.4437 2966.9216 2972.6033 2975.4064 2988.7017 2989.2470 3002.4651 3012.1483 3025.6243 3047.3848 3069.4002 3071.5549 3072.3566 3085.5154 3096.6045 3100.9955 3102.9820 3214.8951
redmass: 3.4001 3.4390 1.5683 5.1523 3.0085 2.9304 3.3129 2.2251 1.0390 1.0555 1.3994 2.1466 3.3465 3.3360 2.9972 3.0129 3.2173 3.2694 3.2070 2.9903 3.7147 1.5505 1.1490 1.7493 2.0719 1.8253 5.4007 1.8727 1.5598 1.4884 1.9174 1.3177 1.5223 1.3885 3.0406 1.7982 1.5381 2.2053 2.9188 2.4417 2.3734 2.0481 1.4386 1.3098 1.3985 1.9875 1.0623 1.3743 1.4197 1.5510 1.7363 1.2253 1.2247 1.1737 1.2426 1.0808 1.0455 1.0556 1.0672 1.0596 1.0710 1.0427 1.0460 1.0799 11.3296 5.1755 1.0593 1.0611 1.0362 1.0601 1.0359 1.0364 1.0961 1.0906 1.0965 1.1028 1.1007 1.0993 1.0970 1.0987 1.1008 1.1006 1.0620 1.1154
irintensity: 0.7393 0.2742 0.0269 2.4669 0.7390 1.7543 0.4343 1.8697 0.8749 0.0848 0.6597 1.1917 1.8945 3.3957 2.4334 2.1104 2.8444 6.7718 2.2271 0.2593 2.1685 10.7306 6.6253 6.0584 8.9849 2.5799 14.4824 3.4626 2.9787 6.9020 3.3124 59.3173 32.4918 20.4115 0.8791 52.7202 10.9144 5.2896 314.2882 116.8867 12.9158 3.4163 3.1474 3.7049 28.1335 74.9431 2.2589 2.5840 1.1040 4.8624 1.8386 30.0178 5.9905 22.4176 11.9583 3.3016 14.6694 11.9922 1.8214 32.2640 4.7791 14.0621 10.6506 17.2864 136.9989 3.1444 7.1911 20.6574 37.3271 63.9426 18.3192 27.6887 5.7919 6.4154 3.5376 48.0216 88.0406 55.5935 16.5100 45.0344 27.2407 19.9780 5.5627 5.7764
temp: 298.150 k
press: 1.00000 atm
elementType: 8 8 6 6 6 6 6 6 6 6 6 6 1 1 1 1 1 1 1 1 1 1 1 1 1 1 1 1 1 1
symmnumber: 1
zpe: 680420.3 jmol-1
zpe.correction: 0.259158 hartree
zpe.thermalcorrener: 0.274275 hartree
zpe.thermalcorrenthalpy: 0.275219 hartree
zpe.thermalcorrgfe: 0.215771 hartree
zpe.sumelectzpe: -541.333156 hartree
zpe.sumelectthermal: -541.318040 hartree
zpe.sumelectthermalent: -541.317095 hartree
zpe.sumelectthermalfe: -541.376544 hartree
dipole: -1.2388 -0.5882 1.6765
dipole: 2.1659
quadrupole: -72.6642 -71.1411 -77.5239
quadrupole: -7.0294 3.9610 0.8032
quadrupole: 1.1122 2.6353 -3.7475 -7.0294 3.9610 0.8032
hfenergy: -541.5923147 hartree
pointgroup: C01 [X(C10H18O2)]
dipole: -0.4960188 -0.3003163 0.6244455 debye
polarizability: 139.5413101|-11.2825186|113.566496|-13.508621|0.1144125|96.9271668 unknown
InChI: InChI=1S/C10H18O2/c1-5-6-7-9(4)12-10(11)8(2)3/h9H,2,5-7H2,1,3-4H3
charge 0 multiplicity 1
30 atoms
O  0.549951 0.273954 0.46819
O  2.032481 0.971592 -1.19674
C  -1.73937 1.063502 0.616857
C  -2.339771 -0.060952 -0.255019
C  -0.320027 1.47885 0.205598
C  -3.764721 -0.465327 0.185467
C  0.241272 2.666053 1.000041
C  -4.366993 -1.58486 -0.690729
C  1.708901 0.14743 -0.303135
C  2.479891 -1.084759 0.08167
C  1.944346 -1.968746 1.188934
C  3.632182 -1.334314 -0.599373
H  -2.384056 1.964282 0.558042
H  -1.725205 0.74999 1.679907
H  -2.363446 0.266299 -1.315614
H  -1.674424 -0.94555 -0.213233
H  -0.26135 1.686366 -0.880309
H  -3.737906 -0.796237 1.243925
H  -4.425701 0.425387 0.155135
H  -0.383586 3.562255 0.831113
H  1.269674 2.900889 0.678382
H  0.244748 2.444245 2.082224
H  -4.434906 -1.266981 -1.748334
H  -3.739822 -2.495612 -0.65536
H  -5.383463 -1.860828 -0.354847
H  1.843284 -1.403818 2.132922
H  0.935459 -2.345446 0.94191
H  2.612878 -2.829565 1.359663
H  4.249002 -2.21187 -0.377446
H  3.966876 -0.65463 -1.390643
