program: Gaussian 09
title: 000097777
version: EM64L-G09RevD.01
frameworkgroup: C1[X(C13H23NO2)]
method: RPBEPBE
basis: SDD
operation: Freq
keyword: #p
keyword: freq=noraman
keyword: PBEPBE/SDD
title: #p freq=noraman PBEPBE/SDD
converged: NO YES NO NO
title: Mulliken charges:
elementType: O O N C C C C C C C C C C C C C H H H H H H H H H H H H H H H H H H H H H H H
charge: -0.229531 -0.224130 -0.178863 0.337625 -0.424783 -0.537287 -0.542135 -0.407280 -0.758892 0.161030 0.167136 -0.366355 -0.358130 -0.610591 -0.356803 -0.696320 0.211373 0.199951 0.240772 0.255443 0.256097 0.237680 0.205664 0.205465 0.220454 0.226462 0.209280 0.193848 0.188683 0.186980 0.192015 0.248629 0.250794 0.266574 0.194858 0.197274 0.216498 0.209234 0.211286
chargesum: 0.00000
title: Mulliken charges with hydrogens summed into heavy atoms:
elementType: O O N C C C C C C C C C C C C C
charge: -0.229531 -0.224130 -0.178863 0.337625 -0.013460 -0.041072 -0.048359 0.003849 -0.102696 0.161030 0.167136 0.016176 0.020864 0.155405 0.035328 -0.059303
polarizability: 1.61460700e+02 -5.62571517e-01 1.47094878e+02 -1.14019420e+01 -4.23150872e+00 1.41401592e+02
1716.lowfreq: -38.1756 -15.7949 -11.3833 0.0005 0.0008 0.0009 5.3000 22.8999 40.9839
frequency: -35.6841 22.6320 40.9775 54.7218 82.4802 91.8460 99.4586 107.9888 119.1205 148.4033 185.7118 198.9671 223.0125 226.4703 252.2337 277.8944 305.7540 317.3499 342.8849 371.3304 394.1684 415.3507 439.6649 464.2219 507.5674 556.8216 580.6786 612.7946 620.8374 719.8647 721.6116 733.2542 778.4859 807.4028 866.9343 887.9160 892.7429 915.6859 925.9810 957.3114 966.2034 977.5052 1008.2441 1032.9668 1043.1966 1067.3277 1080.6481 1083.9346 1110.8104 1117.5782 1126.1795 1134.5865 1159.3064 1173.5075 1194.4076 1216.5582 1239.8706 1256.8237 1267.3446 1281.0391 1285.7867 1287.8011 1290.1878 1297.3462 1302.0915 1323.5884 1330.3634 1339.2198 1351.2861 1357.4068 1387.4034 1389.4481 1424.3779 1433.9584 1452.0922 1457.4115 1461.0998 1464.4953 1472.5986 1473.5765 1476.0051 1476.5052 1479.1168 1480.2096 1483.0823 1487.2833 1586.4422 1631.3574 2949.6969 2953.7529 2955.8422 2965.7106 2971.2901 2971.6575 2972.0683 2973.7928 2978.0961 2986.8668 2998.1009 3006.7227 3015.3632 3026.0499 3043.4701 3062.3286 3066.2130 3068.0435 3070.9230 3075.6666 3079.1721 3106.1321 3143.6639
redmass: 1.5567 4.0279 6.2164 3.0862 3.1804 1.7651 2.1197 1.5411 2.4169 1.9664 2.6356 1.6447 2.2709 1.1558 2.1348 3.2400 2.4367 2.7756 3.2964 4.8011 3.2008 3.4753 3.5083 2.8558 4.2523 3.8062 3.3200 3.7043 4.4318 2.5088 1.2289 1.1570 1.2429 3.1152 1.2943 1.9605 1.9566 2.1898 2.1983 1.4818 1.7775 1.5048 3.3484 2.3147 2.1771 2.6828 2.2026 2.9740 2.3422 2.0370 1.3748 1.6981 2.1968 1.6224 1.6101 1.5347 1.4518 1.4015 1.7854 1.3102 1.2330 1.4043 1.2732 1.8136 1.4011 3.9511 1.4657 1.7078 1.6592 1.5471 1.2154 1.2010 1.2314 1.0809 1.0862 1.0741 1.0686 1.0754 1.0679 1.0657 1.0519 1.0436 1.0681 1.0698 1.0681 1.0884 10.7516 9.6411 1.0589 1.0590 1.0588 1.0592 1.0455 1.0484 1.0597 1.0486 1.0623 1.0972 1.0987 1.1023 1.0331 1.1043 1.1046 1.0964 1.0966 1.1008 1.0992 1.0940 1.0968 1.1019 1.1023
irintensity: 0.0322 0.2699 0.1029 0.1531 0.0254 0.2589 6.2619 1.6555 2.2631 0.8767 0.0293 0.2877 0.1996 0.0087 0.3579 3.3216 1.4194 5.9658 5.2141 15.1405 4.0483 4.3416 0.4546 2.4029 2.1678 3.0934 3.8312 18.2732 8.0243 5.1660 8.6476 0.0507 2.1323 2.6103 0.1087 3.7568 1.9430 7.3129 8.5937 1.7741 4.8677 5.2451 0.3760 2.6083 3.1870 1.0648 0.6452 2.0440 28.4847 101.1168 4.8812 5.9397 6.0676 7.3184 0.1859 2.2089 3.4604 1.1792 60.3731 6.4353 2.6949 6.7928 9.5932 86.3593 24.8520 83.1215 3.2608 18.7438 2.1474 5.2859 11.4491 17.3726 89.3623 7.4637 9.2896 5.3251 0.3833 0.3536 5.7998 5.0982 14.2171 12.3783 14.4850 4.2450 9.9103 26.4933 418.5098 58.1409 0.6148 6.1111 16.3844 31.5619 34.8879 101.2971 8.1131 27.5378 31.9445 0.2494 4.1743 4.1082 22.4286 4.7607 113.1110 6.3071 41.5170 100.2047 52.8620 2.1433 40.5799 16.6876 0.8663
temp: 298.150 k
press: 1.00000 atm
elementType: 8 8 7 6 6 6 6 6 6 6 6 6 6 6 6 6 1 1 1 1 1 1 1 1 1 1 1 1 1 1 1 1 1 1 1 1 1 1 1
symmnumber: 1
zpe: 890791.7 jmol-1
zpe.correction: 0.339285 hartree
zpe.thermalcorrener: 0.357135 hartree
zpe.thermalcorrenthalpy: 0.358079 hartree
zpe.thermalcorrgfe: 0.292432 hartree
zpe.sumelectzpe: -713.135056 hartree
zpe.sumelectthermal: -713.117206 hartree
zpe.sumelectthermalent: -713.116262 hartree
zpe.sumelectthermalfe: -713.181909 hartree
dipole: -1.5370 2.6325 0.5399
dipole: 3.0958
quadrupole: -104.0835 -96.7447 -110.6446
quadrupole: 2.6195 7.2948 6.3072
quadrupole: -0.2592 7.0796 -6.8204 2.6195 7.2948 6.3072
hfenergy: -713.4743407 hartree
pointgroup: C01 [X(C13H23N1O2)]
dipole: -0.6219917 0.963572 0.4100297 debye
polarizability: 161.6240173|1.9426119|148.5798455|-11.0360224|-2.9076183|139.7533075 unknown
InChI: InChI=1S/C13H23NO2/c1-4-5-6-7-8-13(2)9-11(15)14(3)12(16)10-13/h4-10H2,1-3H3
charge 0 multiplicity 1
39 atoms
O  3.383062 0.28708 -2.043316
O  1.705221 -2.170407 1.541411
N  2.556658 -0.941674 -0.236704
C  0.916954 1.326492 0.553554
C  -0.278124 0.871732 -0.345147
C  2.169971 1.5431 -0.336311
C  1.304275 0.243756 1.595517
C  -1.616004 0.587465 0.375775
C  0.580387 2.649372 1.283394
C  2.744364 0.273206 -0.956013
C  1.844291 -1.044747 0.988962
C  -2.719996 0.128422 -0.605264
C  -4.075375 -0.143173 0.084899
C  3.109694 -2.198007 -0.80036
C  -5.177659 -0.603954 -0.896085
C  -6.530403 -0.871095 -0.201565
H  0.01359 -0.037329 -0.91113
H  -0.446238 1.662102 -1.106292
H  2.978637 2.007395 0.26641
H  1.96344 2.234589 -1.172032
H  0.457269 -0.037939 2.242623
H  2.090587 0.649105 2.266487
H  -1.477436 -0.197569 1.146484
H  -1.964129 1.496062 0.906551
H  0.291792 3.435299 0.560592
H  -0.256577 2.51858 1.991906
H  1.450812 3.019153 1.857871
H  -2.384956 -0.791267 -1.128846
H  -2.857358 0.900774 -1.391144
H  -4.413503 0.776347 0.607433
H  -3.939787 -0.915319 0.870924
H  2.294346 -2.909483 -1.010542
H  3.79245 -2.6645 -0.072183
H  3.644819 -1.941604 -1.725643
H  -5.310691 0.167023 -1.682681
H  -4.840219 -1.523314 -1.416819
H  -7.300964 -1.193175 -0.925967
H  -6.902607 0.039455 0.305152
H  -6.433693 -1.664252 0.563702
