program: Gaussian 09
title: 000097753
version: EM64L-G09RevD.01
frameworkgroup: C1[X(C13H10O4)]
method: RPBEPBE
basis: SDD
operation: Freq
keyword: #pfreq=noraman
keyword: PBEPBE/SDD
title: #p freq=noraman PBEPBE/SDD
converged: NO YES NO NO
title: Mulliken charges:
elementType: O O O O C C C C C C C C C C C C C H H H H H H H H H H
charge: -0.217045 -0.331746 -0.361267 -0.172471 0.081730 -0.402980 -0.007220 0.205944 0.170073 -0.318298 0.466367 -0.239920 -0.369861 -0.376696 -0.234499 -0.234833 -0.226504 0.246980 0.247141 0.224299 0.272533 0.227562 0.241870 0.235009 0.237740 0.238776 0.397313
chargesum: 0.00000
title: Mulliken charges with hydrogens summed into heavy atoms:
elementType: O O O O C C C C C C C C C C C C C
charge: -0.217045 0.065568 -0.361267 -0.172471 0.081730 0.091141 -0.007220 0.205944 0.170073 -0.093999 0.466367 0.032612 -0.142299 -0.134826 0.000511 0.002907 0.012272
polarizability: 3.68734123e+02 -1.60078132e+01 1.48704728e+02 1.40084628e-02 4.36082808e-02 6.27196362e+01
1716.lowfreq: -2.3494 -0.0009 -0.0008 -0.0007 4.2683 13.0050 31.2050 41.7720 51.2126
frequency: 31.1280 41.7457 51.2089 92.3633 142.9016 157.0286 162.5603 198.0295 207.7668 279.5629 282.6907 293.4987 304.7391 401.7322 426.7904 476.4118 482.5124 499.2873 562.1711 582.3867 604.2579 614.8750 680.7878 699.3406 725.6152 742.1083 742.8242 778.4929 847.0764 851.4138 884.9735 914.4000 931.2503 932.3482 982.6824 985.6605 989.5544 994.0820 1001.3127 1009.0338 1014.5351 1025.3659 1085.7376 1132.2445 1135.6748 1176.8454 1191.4838 1218.9512 1246.3850 1256.7138 1304.2245 1309.4360 1325.4308 1337.4208 1387.4741 1421.7950 1444.9859 1461.3685 1487.2611 1523.8253 1579.4975 1589.5236 1610.0376 1633.4272 1717.2571 2508.1410 3005.3614 3061.6453 3102.5862 3126.1688 3129.3244 3133.3771 3144.6427 3156.0739 3171.0061
redmass: 4.8433 5.5710 6.3230 5.5747 8.0682 5.3538 4.8063 6.9551 3.2215 3.4160 2.8399 5.7518 9.1522 2.7402 7.2956 4.3351 6.6358 4.1818 6.9738 6.0682 11.6864 6.4830 3.3425 2.0332 6.3199 8.5254 5.4710 2.0572 1.2850 5.0956 1.7683 5.3224 1.4158 9.0194 1.3852 5.9354 6.1224 1.7009 1.3166 1.0819 1.2591 2.2000 1.6163 1.0656 3.2947 1.0691 1.1314 1.6404 2.9671 2.3427 1.5283 1.5709 2.5523 1.4015 6.7458 4.4656 2.4635 1.1084 2.4158 3.2154 5.5452 5.5809 5.9914 5.5148 12.5917 1.0710 1.0572 1.1078 1.0904 1.0899 1.0867 1.0871 1.0917 1.0965 1.1016
irintensity: 0.0637 2.2545 0.9159 1.6986 1.7547 3.1747 1.7075 0.1579 7.0169 1.4337 0.6661 16.6200 0.5088 0.0148 1.2874 0.2789 15.6150 15.2859 29.7306 0.6340 11.1029 0.0628 16.8739 30.0425 11.0818 8.7215 15.2568 53.5189 0.5550 6.9198 12.7492 39.6987 0.0788 74.3597 0.4715 54.1284 17.0157 4.9611 9.2161 132.3151 35.5001 2.7476 11.1625 0.0843 155.0911 3.0133 36.1747 72.4711 219.7813 38.2590 20.7289 7.2019 11.7723 30.7945 1.9744 121.5770 65.3756 4.3311 34.6831 18.8687 64.6499 966.5902 4.0231 275.1461 442.7267 211.1926 16.0383 10.6292 0.1829 9.4032 3.2232 2.7284 3.1001 31.3881 31.4219
temp: 298.150 k
press: 1.00000 atm
elementType: 8 8 8 8 6 6 6 6 6 6 6 6 6 6 6 6 6 1 1 1 1 1 1 1 1 1 1
symmnumber: 1
zpe: 518843.3 jmol-1
zpe.correction: 0.197617 hartree
zpe.thermalcorrener: 0.211954 hartree
zpe.thermalcorrenthalpy: 0.212898 hartree
zpe.thermalcorrgfe: 0.154667 hartree
zpe.sumelectzpe: -801.064063 hartree
zpe.sumelectthermal: -801.049727 hartree
zpe.sumelectthermalent: -801.048783 hartree
zpe.sumelectthermalfe: -801.107013 hartree
dipole: 9.6212 -2.2380 0.0036
dipole: 9.8780
quadrupole: -120.2691 -94.8054 -100.3090
quadrupole: -0.4120 -0.0246 0.0252
quadrupole: -15.1413 10.3224 4.8188 -0.4120 -0.0246 0.0252
hfenergy: -801.2616803 hartree
pointgroup: C01 [X(C13H10O4)]
dipole: 3.7820003 -0.8930553 0.0493061 debye
dipolederiv: -0.7445275 0.0913004 -0.0051062 0.1012382 -0.7256211 0.0286167 -0.006034 0.0287749 -0.2953421 -0.6443988 0.0096023 0.0004007 0.8864117 -0.9188364 0.037096 -0.0586105 0.0392857 -0.3304043 -0.9025518 0.0649279 -0.0027438 0.2268373 -0.9193763 0.0362639 -0.0124416 0.0359483 -0.3630249 -1.422059 0.1907593 -0.010763 -0.0542783 -0.435761 0.0090034 0.0066474 0.0081245 -0.3050246 -1.6877552 0.00107 0.0036471 -0.2363525 -0.1818659 0.0008765 0.0180209 0.000391 -0.1698639 0.3295922 -0.051702 0.003576 0.3073757 0.203962 0.0108603 -0.0205389 0.0120103 0.3761159 0.458261 -0.1317198 0.007849 -1.2655959 0.7341111 -0.0361985 0.083409 -0.0392075 0.142715 2.7382145 -0.0726167 -0.0017809 -0.214084 0.7633328 -0.0358952 0.0068429 -0.035784 0.212538 2.2322931 -0.2773159 0.0144661 0.0372873 0.904919 -0.0428409 -0.0059361 -0.041875 0.2685263 -1.9637493 0.2478399 -0.0115497 -0.2135514 0.066986 -0.0183923 0.0177399 -0.0193059 -0.2315723 -0.6298086 0.1209027 -0.0058538 0.2626482 -0.0801924 0.0056512 -0.0141789 0.0059998 0.0197399 1.5383903 -0.1964671 0.0084708 0.1076164 0.1199556 -0.0100093 -0.0128017 -0.009457 -0.0404826 0.0815092 0.0689585 -0.0051675 -0.2700519 0.0214814 -0.0086832 0.0157857 -0.0094588 -0.125073 0.1834886 -0.1469649 0.0083101 0.2195499 0.0654328 -0.014058 -0.0147357 -0.0132815 -0.145777 -0.3563023 -0.0522343 0.0038253 -0.2169486 0.1535722 -0.0181929 0.0145584 -0.0186676 -0.1411792 -0.016276 0.1793889 -0.0119204 0.3499635 -0.0605953 -0.0061234 -0.0228044 -0.0057229 -0.1404522 0.0815708 -0.038432 0.0014555 0.0275885 0.0170752 -0.0098381 -0.0026709 -0.0096613 -0.1375984 0.0192 0.0518376 0.0403229 0.0117645 0.017144 -0.0577234 0.0527271 -0.0921677 -0.0034597 0.0190343 0.0460073 -0.0467945 0.0046553 0.036528 0.0522604 -0.0537459 0.086549 -0.022616 0.0724915 -0.0031258 0.0003235 0.0225343 -0.0912786 0.0159758 -0.0007274 0.0158679 0.1607575 0.1007109 -0.0073527 0.0005833 0.033693 -0.0170305 0.0099022 -0.0016495 0.0101951 0.1430593 0.0058054 -0.1108865 0.0075878 -0.0804921 0.0140048 0.0083928 0.0057147 0.0084429 0.141218 0.0926043 0.0686846 -0.0041248 0.0268981 -0.0658056 0.0139006 -0.0014241 0.0138913 0.1536067 0.0569193 0.0342557 -0.001818 0.0839895 -0.0983971 0.0161157 -0.0049198 0.0162778 0.1583433 -0.0548846 -0.0883416 0.006347 -0.1195101 0.0051802 0.010338 0.0083561 0.0102719 0.1610468 -0.1037816 0.057583 -0.0026591 0.064556 0.0758797 0.0051143 -0.0030704 0.0051208 0.16 0.5160091 -0.0559589 0.0031164 -0.1037426 0.3951952 -0.0024127 0.0064874 -0.002562 0.3542034 unknown
polarizability: 368.6114681|-16.8323284|148.4728009|0.2782166|-5.4978882|63.0742184 unknown
InChI: InChI=1S/C13H10O4/c14-11(10-8-17-13(16)12(10)15)7-6-9-4-2-1-3-5-9/h1-7,15H,8H2
charge 0 multiplicity 1
27 atoms
O  -3.907316 -1.740977 0.116392
O  -3.594641 1.870728 -0.124298
O  -1.065924 1.972639 -0.135167
O  -5.753965 -0.295237 0.024501
C  -2.177388 -0.10759 0.003992
C  -2.419896 -1.595716 0.104351
C  -3.405044 0.540048 -0.03637
C  -0.947944 0.668325 -0.050798
C  -4.52777 -0.451826 0.031044
C  0.360557 0.009406 -0.010486
C  2.899107 0.232769 -0.030672
C  1.52524 0.736812 -0.058733
C  3.223088 -1.154898 0.056274
C  3.967405 1.175721 -0.094204
C  4.564879 -1.577215 0.078066
C  5.311307 0.752221 -0.072407
C  5.614918 -0.626549 0.013772
H  -2.044945 -2.169791 -0.762153
H  -2.042374 -2.048582 1.038906
H  0.366412 -1.085157 0.058712
H  1.402212 1.828068 -0.126977
H  2.424207 -1.902759 0.106607
H  3.731395 2.244563 -0.16148
H  4.800338 -2.644836 0.145013
H  6.118756 1.490174 -0.122221
H  6.658125 -0.960242 0.030856
H  -2.61254 2.264701 -0.15162
