program: Gaussian 09
title: 000097725
version: EM64L-G09RevD.01
frameworkgroup: C1[X(C6H13NO3)]
method: RPBEPBE
basis: SDD
operation: Freq
keyword: #p
keyword: freq=noraman
keyword: PBEPBE/SDD
title: #p freq=noraman PBEPBE/SDD
converged: YES YES NO NO
title: Mulliken charges:
elementType: O O O N C C C C C C H H H H H H H H H H H H H
charge: -0.450677 -0.413566 -0.236853 -0.615975 -0.386405 -0.353658 -0.138760 -0.367978 -0.339098 0.148322 0.210404 0.218019 0.196157 0.174322 0.241866 0.219014 0.217229 0.187044 0.189154 0.272231 0.305822 0.342590 0.380794
chargesum: 0.00000
title: Mulliken charges with hydrogens summed into heavy atoms:
elementType: O O O N C C C C C C
charge: -0.108087 -0.032772 -0.236853 -0.037922 0.042018 0.016821 0.103106 0.068265 0.037100 0.148322
polarizability: 1.04836527e+02 2.40367496e+00 7.67741736e+01 -5.85160004e+00 2.21558859e+00 6.65135060e+01
1716.lowfreq: -7.7054 0.0001 0.0009 0.0011 6.8788 15.1767 42.3066 61.6071 63.8937
frequency: 42.2319 61.0279 63.6897 81.3949 127.3952 135.3181 176.3907 219.3239 232.2962 272.0164 299.1876 352.2407 377.2044 449.8181 479.1628 517.8685 591.8082 606.1486 701.5806 755.9429 799.4431 831.3036 897.5893 955.5440 971.6149 1013.3383 1046.5861 1052.1585 1072.9097 1083.5051 1129.6388 1156.4464 1193.3958 1205.6242 1237.9531 1257.3487 1267.3071 1287.0697 1297.2785 1312.6643 1321.9241 1356.4944 1382.3455 1414.3476 1453.9396 1467.8131 1475.8366 1488.8542 1603.6588 1667.5718 2925.5875 2950.1929 2973.2733 2976.8690 2988.8371 2994.5257 2997.9948 3047.3973 3062.9704 3491.9552 3513.6807 3566.6485 3636.3127
redmass: 6.7560 2.1671 4.0602 4.6599 2.2309 2.3188 3.7234 1.2082 4.5573 1.0860 3.9715 2.7386 2.8671 4.2766 1.4887 2.9494 1.5074 2.5737 4.0340 1.1322 1.3475 2.4055 1.7954 2.2637 4.4242 2.3778 3.6799 2.9549 2.0822 2.0863 1.2834 1.3408 1.5449 1.4712 1.3708 1.3639 1.4352 1.1197 1.1252 1.2721 1.3225 1.5572 1.8892 1.4434 1.0822 1.0745 1.0888 1.0916 1.2715 4.1347 1.0544 1.0584 1.1067 1.0623 1.0803 1.0605 1.0986 1.1044 1.1049 1.0451 1.0640 1.0664 1.0991
irintensity: 1.8070 5.3253 5.2533 1.7007 3.5984 2.4660 2.0580 53.0079 4.7593 157.4975 3.4709 2.9218 31.4206 53.7341 248.3247 11.7914 147.1410 29.1668 50.5867 9.5704 0.6035 4.5284 1.7982 3.2629 79.2499 28.9417 65.4288 209.0543 14.7892 9.0593 8.6287 1.7131 13.9589 16.5453 15.0288 0.8187 24.8627 1.4845 0.6036 17.9046 4.2872 3.3878 16.0773 5.3565 3.0905 0.1168 7.3398 8.9151 157.1264 161.5645 59.7209 40.8069 51.5822 18.1936 22.8591 43.0946 12.8337 8.6756 103.1967 11.2392 24.8139 2.3267 10.6548
temp: 298.150 k
press: 1.00000 atm
elementType: 8 8 8 7 6 6 6 6 6 6 1 1 1 1 1 1 1 1 1 1 1 1 1
symmnumber: 1
zpe: 504643.5 jmol-1
zpe.correction: 0.192209 hartree
zpe.thermalcorrener: 0.204735 hartree
zpe.thermalcorrenthalpy: 0.205679 hartree
zpe.thermalcorrgfe: 0.152494 hartree
zpe.sumelectzpe: -516.020575 hartree
zpe.sumelectthermal: -516.008049 hartree
zpe.sumelectthermalent: -516.007105 hartree
zpe.sumelectthermalfe: -516.060290 hartree
dipole: 2.1102 0.3042 -1.3057
dipole: 2.5001
quadrupole: -61.5380 -58.8151 -64.2534
quadrupole: 14.6396 -5.0076 1.3924
quadrupole: -0.0025 2.7204 -2.7179 14.6396 -5.0076 1.3924
hfenergy: -516.2127839 hartree
pointgroup: C01 [X(C6H13N1O3)]
dipole: 0.8252315 -0.150056 0.5137859 debye
dipolederiv: -0.746905 -0.2270023 0.2012606 -0.2720498 -0.4491399 -0.1287957 0.2458047 -0.1267563 -0.472362 -0.3865358 0.1348245 0.1683739 0.173427 -1.0180254 -0.3945289 0.1557484 -0.3304045 -0.521282 -0.7418005 -0.1023211 -0.3066698 0.1177137 -0.5873587 -0.1139575 -0.3153433 -0.2777457 -0.6450719 -0.5599567 -0.2042504 0.2169224 -0.3121035 -0.7321574 0.0576531 0.2363222 0.1516414 -0.4913486 0.016187 -0.0685105 0.0149521 0.0696922 -0.0485207 0.0624039 -0.0206504 0.0878303 0.0919143 -0.0479067 0.0079218 0.0043446 -0.0563354 0.1386682 0.0528226 0.0507526 0.0523548 0.1556512 -0.1647455 0.2186091 -0.1721962 0.2371048 0.5463431 0.0174598 -0.1677905 0.1121086 0.2834816 -0.1297001 0.0188279 -0.0174589 0.0824939 0.0869794 0.0386695 -0.0888398 0.0337221 0.0948279 0.6592419 0.1638007 -0.144108 0.1147499 0.3977935 0.0408691 -0.1021915 0.0405169 0.4058211 1.0296569 -0.1823012 0.355735 -0.4442132 1.1458585 0.4845856 0.438678 0.5417887 0.7983728 0.0195355 -0.0047687 -0.0108322 0.0081307 0.0758053 -0.0283048 -0.0015157 0.0037211 -0.1529471 0.0495651 -0.0358049 0.0057828 -0.0028263 -0.1578362 -0.0229265 -0.0203569 -0.049376 0.0646623 0.0424019 0.0007407 0.0026169 -0.0088188 0.0640951 -0.0173529 -0.0037469 0.0076439 -0.1912984 0.069475 0.004493 0.0009206 0.0132893 -0.2044447 -0.0219572 0.0072532 -0.0459565 0.0546415 0.0718127 -0.0306321 -0.0249686 -0.0181485 -0.0093497 -0.0359002 -0.000525 -0.062964 -0.1337707 0.066081 -0.0109011 -0.0227995 0.0083522 0.0729521 -0.0166119 -0.0053799 -0.0042841 -0.1545451 0.0591657 0.0232506 0.0143554 0.0083818 -0.14851 -0.0293773 -0.0062779 -0.0398923 0.0681282 -0.0189066 -0.0271022 0.0276798 -0.0246176 -0.2528152 -0.0092341 0.0316446 -0.0496633 0.0296733 -0.0178397 -0.0306186 0.0230574 -0.0345386 0.0330018 -0.0210448 0.0212191 0.0195872 -0.2544476 0.1325193 0.1726243 -0.086149 0.1304286 0.2140369 -0.051658 -0.0816634 -0.1321145 0.2751621 0.3201112 0.0227954 -0.0491246 0.0489909 0.2414652 0.012943 -0.08935 -0.086344 0.1250781 0.0755964 0.0875133 -0.0814602 0.1267891 0.2643644 0.119304 -0.1157416 0.1184723 0.2868813 0.202947 0.0688118 -0.1202345 0.0341074 0.3267945 0.0049394 -0.16805 0.0361139 0.2827777 unknown
polarizability: 104.7002578|-2.9431231|76.610612|6.034354|2.5855775|66.8133373 unknown
InChI: InChI=1S/C6H13NO3/c7-5(6(9)10)3-1-2-4-8/h5,8-9H,1-4,7H2
charge 0 multiplicity 1
23 atoms
O  4.849525 0.461956 -0.366445
O  -2.779427 1.556863 0.594871
O  -3.40496 -0.02794 -0.982756
N  -1.582144 -1.831305 0.070066
C  -0.120563 0.269662 -0.198122
C  1.187778 -0.346109 0.34309
C  -1.396837 -0.419344 0.40952
C  2.442838 0.330691 -0.25346
C  3.746484 -0.263436 0.287257
C  -2.626707 0.338446 -0.073876
H  -0.155111 0.173578 -1.301848
H  -0.144477 1.349133 0.048158
H  1.202477 -0.254639 1.449673
H  1.216437 -1.432024 0.11158
H  -1.341418 -0.294456 1.509394
H  2.441119 0.229016 -1.355809
H  2.431485 1.414895 -0.030184
H  3.795646 -1.350407 0.05487
H  3.792084 -0.14053 1.391993
H  -0.769778 -2.432956 0.205357
H  -2.108276 -1.994143 -0.792258
H  5.716053 0.108787 -0.042116
H  -3.566327 2.040163 0.222647
