program: Gaussian 09
title: 000010953
version: EM64L-G09RevD.01
frameworkgroup: C1[X(C5H8O2)]
method: RPBEPBE
basis: SDD
operation: Freq
keyword: #p
keyword: freq=noraman
keyword: PBEPBE/SDD
title: #p freq=noraman PBEPBE/SDD
converged: YES YES NO NO
title: Mulliken charges:
elementType: O O C C C C C H H H H H H H H
charge: -0.219542 -0.225034 -0.400471 -0.401722 -0.505745 -0.292638 0.219903 0.228945 0.212345 0.219511 0.220582 0.243750 0.256054 0.232376 0.211686
chargesum: 0.00000
title: Mulliken charges with hydrogens summed into heavy atoms:
elementType: O O C C C C C
charge: -0.219542 -0.225034 0.040819 0.038371 -0.005941 0.151424 0.219903
polarizability: 6.97034099e+01 -4.45486530e+00 5.70039293e+01 2.07251188e-01 -5.00328108e-01 4.40412781e+01
1716.lowfreq: -18.2818 0.0007 0.0008 0.0008 9.5000 16.2644 96.0439 140.8153 309.8123
frequency: 96.0044 140.8016 309.8114 392.5338 434.7911 472.7500 528.7614 621.8325 699.4599 814.0329 862.4718 890.5054 919.6719 968.8916 1028.3574 1082.1396 1090.9976 1130.3485 1162.8396 1211.4351 1245.2791 1261.4831 1322.4012 1343.6965 1352.9287 1368.9112 1442.2566 1459.7887 1471.2195 1482.7046 1658.5739 2990.3130 2992.4203 2995.3060 3001.7101 3053.8627 3060.4484 3074.3484 3090.6397
redmass: 3.3641 2.5920 1.6776 4.8151 3.7995 3.0921 3.4218 2.5870 4.7357 1.4661 2.8785 3.2479 1.4021 2.5021 2.7048 1.7777 1.6952 3.4529 1.2196 1.6247 1.2712 1.1992 1.4186 1.4248 1.4743 1.3205 1.0779 1.0882 1.0867 1.0902 11.9783 1.0681 1.0615 1.0613 1.0650 1.0983 1.1002 1.0969 1.1035
irintensity: 1.4989 6.8923 1.0028 1.8566 2.0077 2.6799 4.2564 4.2673 12.0070 9.0882 6.9018 30.9577 4.6387 13.1360 146.8049 22.9169 1.3877 80.6437 0.5261 100.8056 1.2473 4.0947 3.8488 0.6124 3.2443 2.6778 12.1011 16.4392 11.3052 6.8352 285.2122 9.6323 30.3049 24.0458 40.6284 28.9828 50.6457 16.1260 33.7945
temp: 298.150 k
press: 1.00000 atm
elementType: 8 8 6 6 6 6 6 1 1 1 1 1 1 1 1
symmnumber: 1
zpe: 326142.3 jmol-1
zpe.correction: 0.124221 hartree
zpe.thermalcorrener: 0.130684 hartree
zpe.thermalcorrenthalpy: 0.131628 hartree
zpe.thermalcorrgfe: 0.093692 hartree
zpe.sumelectzpe: -345.221267 hartree
zpe.sumelectthermal: -345.214804 hartree
zpe.sumelectthermalent: -345.213860 hartree
zpe.sumelectthermalfe: -345.251796 hartree
dipole: 5.2820 1.7110 0.0680
dipole: 5.5527
quadrupole: -49.9794 -40.8855 -40.0139
quadrupole: -3.7634 0.1466 -0.4102
quadrupole: -6.3531 2.7408 3.6124 -3.7634 0.1466 -0.4102
hfenergy: -345.3454877 hartree
pointgroup: C01 [X(C5H8O2)]
dipole: 2.0907285 -0.6291926 -0.0733862 debye
dipolederiv: -0.9871758 -0.2751737 0.0341576 -0.6943563 -0.9046519 0.1044553 -0.0338174 0.0348774 -0.3025254 -1.2327704 -0.1252965 0.0197739 0.0006856 -0.5544005 0.0158194 0.0142451 0.0155261 -0.3510232 0.0537509 -0.0293461 0.0164129 -0.0167518 0.0337436 -0.0165967 -0.0255501 -0.0039982 0.1445119 -0.0498866 -0.0000963 -0.0291994 0.0351496 -0.0607381 0.0104018 -0.002803 0.0157012 0.1116368 -0.0613306 0.0858381 -0.0080069 0.1029551 -0.2385957 0.0322054 -0.0574202 0.0595475 0.1304974 0.7184947 0.1711427 -0.0718835 0.0261951 0.286931 -0.0298834 -0.0323351 -0.0372148 0.3550973 1.6301634 0.2564533 0.0046376 0.5553994 1.3160689 -0.1087863 0.0541251 -0.0714888 0.2112537 -0.0184435 0.1117415 -0.0167641 0.1141262 -0.1212933 0.0318777 -0.0351856 0.0565646 0.076115 0.0395753 -0.0223092 0.0019542 -0.0381762 0.0774848 0.036771 0.0366006 -0.0187497 -0.1732603 0.1010887 -0.0006729 0.0325439 0.0141927 0.0292693 0.0174312 -0.0247965 0.0047163 -0.1624793 -0.1723637 -0.0482656 0.0405934 -0.0121291 0.0698015 0.005357 0.060299 0.0080894 0.084169 0.0510928 0.0392515 0.003957 0.0196831 0.0840699 0.0196053 0.0394959 0.050922 -0.0852482 -0.0067132 -0.0695659 -0.0481696 -0.062378 0.0064002 -0.0558459 -0.0384486 -0.0925916 0.0681158 -0.0075748 -0.0571049 -0.0000495 -0.0627176 -0.1029667 -0.0630069 -0.0320015 -0.1027105 0.051148 -0.0579071 -0.0365962 0.0200426 0.0181222 0.0788772 0.0001949 0.0775923 0.080809 -0.1580086 unknown
polarizability: 69.477685|4.6980349|57.1833849|-0.9240727|-0.7983584|44.0875473 unknown
InChI: InChI=1S/C5H8O2/c6-5-3-1-2-4-7-5/h1-4H2
charge 0 multiplicity 1
15 atoms
O  -0.413377 1.213873 0.0194
O  -2.338783 0.003079 0.073199
C  1.194613 -1.204478 -0.307743
C  1.825213 0.064225 0.300382
C  -0.277724 -1.311203 0.1429
C  1.06517 1.296447 -0.199133
C  -1.092531 -0.01586 0.051378
H  1.746809 -2.111074 -0.001592
H  1.250589 -1.149137 -1.412796
H  1.788359 0.014072 1.405761
H  2.887622 0.163062 0.008487
H  -0.3233 -1.620052 1.206794
H  -0.832712 -2.078349 -0.423832
H  1.361815 2.219175 0.325174
H  1.215137 1.437019 -1.286879
